Methane-d3

Phase change data

Data compiled by: Thermodynamics Research Center, NIST Boulder Laboratories, Chris Muzny director

Quantity Value Units Method Reference Comment
Ttriple89.94KN/AArmstrong, Brickwedde, et al., 1953Uncertainty assigned by TRC = 0.03 K
Quantity Value Units Method Reference Comment
Ptriple0.1068barN/AArmstrong, Brickwedde, et al., 1953Uncertainty assigned by TRC = 0.0003 bar

In addition to the Thermodynamics Research Center (TRC) data available from this site, much more physical and chemical property data is available from the following TRC products:

Vibrational and/or electronic energy levels

Data compiled by: Takehiko Shimanouchi

Symmetry:   C     Symmetry Number σ = 3

 Sym.   No   Approximate   Selected Freq.  Infrared   Raman   Comments
 Species   type of mode   Value   Rating   Value  Phase  Value  Phase

a1 1 CH str 2993  C 2993 M gas
a1 2 CD3 s-str 2142  C 2142 M gas 2141 gas
a1 3 CD3 s-deform 1003  C 1003 M gas
e 4 CD3 d-str 2263  C 2263 M gas 2269 gas
e 5 CD3 rock 1291  C 1291 M gas 1299 gas
e 6 CD3 d-deform 1036  C 1036 S gas 1046 gas

Source: Shimanouchi, 1972

References

Armstrong, Brickwedde, et al., 1953
Armstrong, G.T.; Brickwedde, F.G.; Scott, R.B., The Vapor Pressure of the Deuteromethanes, J. Chem. Phys., 1953, 21, 1297. [all data]

Shimanouchi, 1972
Shimanouchi, T., Tables of Molecular Vibrational Frequencies Consolidated Volume I, National Bureau of Standards, 1972, 1-160. [all data]