Bicyclogermacrene

Normal alkane RI, polar column, temperature ramp

Data compiled by: NIST Mass Spectrometry Data Center, William E. Wallace, director

Column type CapillaryCapillaryCapillaryCapillary
Active phase RTX-WaxBP-20DB-WaxCW 20M
Column length (m) 60. 15.25.
Carrier gas HeliumNitrogenHeliumHydrogen
Substrate
Column diameter (mm) 0.22 0.250.32
Phase thickness (μm) 0.25 0.250.25
Tstart (C) 60.60.40.50.
Tend (C) 230.200.260.220.
Heat rate (K/min) 2.5.4.3.
Initial hold (min)    1.
Final hold (min) 5. 5.10.
I 1706.1735.1769.1699.
ReferenceBendiabdellah, El Amine Dib, et al., 2012Mishra, Chaudhary, et al., 2010Miyazawa, Kawauchi, et al., 2010Bicchi, Binello, et al., 1999
Comment MSDC-RI MSDC-RI MSDC-RI MSDC-RI

Normal alkane RI, non-polar column, temperature ramp

View large format table.

Column type Active phase I Reference Comment
CapillaryHP-5 MS1505.Pripdeevech and Saansoomchai, 201330. m/0.25 mm/0.25 μm, Helium, 3. K/min; Tstart: 60. C; Tend: 230. C
CapillaryRTX-11494.Bendiabdellah, El Amine Dib, et al., 201260. m/0.22 mm/0.25 μm, Helium, 2. K/min, 230. C @ 5. min; Tstart: 60. C
CapillaryHP-5 MS1492.Dutra, Pittella, et al., 201230. m/0.25 mm/0.25 μm, Helium, 80. C @ 3. min, 4. K/min, 240. C @ 10. min
CapillaryHP-5 MS1532.Jian-Yu, Zhu, et al., 201230. m/0.25 mm/0.25 μm, Helium, 40. C @ 1. min, 3. K/min, 250. C @ 3. min
CapillaryDB-51494.Silva, Suzuki, et al., 201235. m/0.20 mm/0.10 μm, Helium, 4. K/min; Tstart: 50. C; Tend: 200. C
CapillaryDB-51510.Silva, Suzuki, et al., 201235. m/0.20 mm/0.10 μm, Helium, 4. K/min; Tstart: 50. C; Tend: 200. C
CapillaryDB-51511.Silva, Suzuki, et al., 201235. m/0.20 mm/0.10 μm, Helium, 4. K/min; Tstart: 50. C; Tend: 200. C
CapillaryHP-5 MS1493.Zouari, Ayadi, et al., 201230. m/0.25 mm/0.25 μm, Helium, 50. C @ 1. min, 7. K/min, 250. C @ 5. min
CapillaryHP-11496.Alizadeh, Khosh-Khui, et al., 201130. m/0.25 mm/0.25 μm, Helium, 3. K/min; Tstart: 60. C; Tend: 240. C
CapillaryCP-Sil 5 CB1494.Ameen, Usman, et al., 201125. m/0.25 mm/0.15 μm, Helium; Tstart: 50. C; Tend: 220. C
CapillaryDB-51495.Andrade, Cardoso, et al., 201130. m/0.25 mm/0.25 μm, Helium, 3. K/min; Tstart: 60. C; Tend: 240. C
CapillaryHP-51500.Bertoli, Lepnardi, et al., 201130. m/0.25 mm/0.25 μm, Helium, 3. K/min; Tstart: 60. C; Tend: 240. C
CapillaryDB-51495.Fraternale, Ricci, et al., 201130. m/0.25 mm/0.25 μm, Helium, 3. K/min; Tstart: 60. C; Tend: 240. C
CapillaryHP-5 MS1483.Hammami, Kamoun, et al., 201130. m/0.25 mm/0.25 μm, Helium, 2. K/min; Tstart: 50. C; Tend: 180. C
CapillaryHP-51500.Kahriman, Tosun, et al., 201130. m/0.32 mm/0.25 μm, Helium, 60. C @ 2. min, 3. K/min; Tend: 240. C
CapillaryDB-51494.Karimi, Farmani, et al., 201130. m/0.25 mm/0.25 μm, Helium, 3. K/min; Tstart: 60. C; Tend: 240. C
CapillaryZB-51510.Vazques, Aimar, et al., 201130. m/0.25 mm/0.25 μm, Nitrogen, 40. C @ 5. min, 5. K/min; Tend: 200. C
CapillaryZB-51512.Vazquez, Demmel, et al., 201130. m/0.25 mm/0.25 μm, Nitrogen, 40. C @ 5. min, 5. K/min, 200. C @ 5. min
CapillaryDB-51502.Yousefzadi, Heidari, et al., 2011Nitrogen, 60. C @ 1. min, 4. K/min, 250. C @ 10. min; Column length: 30. m; Column diameter: 0.25 mm
CapillaryDB-5 MS1504.Mesa-Arango, Betancur-Galvis, et al., 201060. m/0.25 mm/0.25 μm, Helium, 40. C @ 15. min, 5. K/min, 250. C @ 15. min
CapillaryBP-11490.Mishra, Chaudhary, et al., 2010Nitrogen, 60. C @ 10. min, 5. K/min, 220. C @ 30. min
CapillaryHP-51503.Miyazawa, Kawauchi, et al., 201030. m/0.25 mm/0.25 μm, Helium, 4. K/min, 260. C @ 5. min; Tstart: 40. C
CapillaryHP-51499.Monsef-Esfahani, Miri, et al., 201030. m/0.25 mm/0.25 μm, Helium, 50. C @ 5. min, 3. K/min; Tend: 240. C
CapillaryHP-5 MS1491.Pripdeevech, Chumpolsri, et al., 201030. m/0.25 mm/0.25 μm, Helium, 2. K/min; Tstart: 100. C; Tend: 220. C
CapillaryHP-51507.Radulovic, Dordevic, et al., 201030. m/0.25 mm/0.25 μm, Hydrogen, 5. K/min; Tstart: 70. C; Tend: 290. C
CapillaryHP-5 MS1499.Radulovic, Dordevic, et al., 2010, 230. m/0.25 mm/0.25 μm, Helium, 5. K/min, 290. C @ 10. min; Tstart: 70. C
CapillaryDB-5 MS1494.Silva, Pott, et al., 201030. m/0.25 mm/0.25 μm, Helium, 3. K/min; Tstart: 60. C; Tend: 240. C
CapillaryDB-1-MS1482.Takeoka, Hobbs, et al., 201060. m/0.25 mm/0.25 μm, Helium, 30. C @ 4. min, 2. K/min, 200. C @ 35. min
CapillaryOV-1011491.Benites, Moiteiro, et al., 200950. m/0.25 mm/0.25 μm, Helium, 2. K/min; Tstart: 70. C; Tend: 220. C
CapillaryOV-1011500.Benites, Moiteiro, et al., 200950. m/0.25 mm/0.25 μm, Helium, 2. K/min; Tstart: 70. C; Tend: 220. C
CapillaryDB-5 MS1502.Koba, Sanda, et al., 200930. m/0.25 mm/0.25 μm, Helium, 50. C @ 5. min, 2. K/min; Tend: 250. C
CapillaryDB-5 MS1503.Su, Wang, et al., 200930. m/0.25 mm/0.25 μm, Helium, 40. C @ 2. min, 4. K/min, 250. C @ 2. min
CapillaryBPX-51501.Shellie, 20087.5 m/0.10 mm/10. μm, Helium, 3. K/min; Tstart: 60. C; Tend: 240. C
CapillaryDB-11501.Ghasempour, Shirinpour, et al., 200760. m/0.25 mm/0.25 μm, Nitrogen, 60. C @ 1. min, 4. K/min, 250. C @ 10. min
CapillaryDB-11501.Reza, Ebrahim, et al., 200760. m/0.25 mm/0.25 μm, Nitrogen, 60. C @ 1. min, 4. K/min, 250. C @ 10. min
CapillaryDB-51498.Mirza, Navaei, et al., 200630. m/0.25 mm/0.25 μm, Helium, 50. C @ 5. min, 3. K/min; Tend: 250. C
CapillaryHP-51486.N/A30. m/0.32 mm/0.25 μm, Helium, 40. C @ 2. min, 5. K/min, 250. C @ 5. min
CapillaryHP-51493.Velickovic, Ristic, et al., 200325. m/0.32 mm/0.53 μm, Helium, 4. K/min; Tstart: 40. C; Tend: 280. C
CapillaryHP-51495.Velickovic, Ristic, et al., 200325. m/0.32 mm/0.53 μm, Helium, 4. K/min; Tstart: 40. C; Tend: 280. C
CapillaryHP-51500.Velickovic, Ristic, et al., 200325. m/0.32 mm/0.53 μm, Helium, 4. K/min; Tstart: 40. C; Tend: 280. C
CapillaryOV-11470.Bicchi, Binello, et al., 199925. m/0.32 mm/0.30 μm, Hydrogen, 50. C @ 1. min, 3. K/min, 200. C @ 10. min
CapillaryDB-51495.Tellez, Estell, et al., 199730. m/0.25 mm/0.25 μm, Helium, 3. K/min; Tstart: 60. C; Tend: 240. C

Normal alkane RI, non-polar column, custom temperature program

View large format table.

Column type Active phase I Reference Comment
CapillaryDB-11487.Albano, Lima, et al., 201230. m/0.25 mm/0.25 μm, Hydrogen; Program: 45 0C 3 0C/min -> 175 0C 15 0C/min -> 300 0C (10 min)
CapillaryRTX-11490.Bendiabdellah, El Amine Dib, et al., 201260. m/0.22 mm/0.25 μm, Helium; Program: not specified
CapillaryHP-5 MS1496.Sharopov, Sulaimonova, et al., 201230. m/0.25 mm/0.25 μm, Helium; Program: 40 0C (10 min) 3 0C/min -> 200 0C 2 0C/min -> 220 0C
CapillaryPolydimethyl siloxane with 5 % Ph groups1493.da Silva, de Souza, et al., 201230. m/0.25 mm/0.25 μm, Helium; Program: 50 0C 4 0C/min -> 200 0C (5 min) 20 0C/min -> 280 0C
CapillaryDB-51500.Andrade, Cardoso, et al., 201130. m/0.25 mm/0.25 μm, Helium; Program: not specified
Capillary5 % Phenyl polydimethyl siloxane1497.Chaverri, Diaz, et al., 2011Program: not specified
CapillaryCBP-51498.Fortes, Naves, et al., 201130. m/0.25 mm/0.25 μm, Helium; Program: 60 0C 3 0C/min -> 246 0C 10 0C/min -> 270 0C (5 min)
CapillaryHP-51500.Kahriman, Tosun, et al., 201130. m/0.32 mm/0.25 μm, Helium; Program: not specified
CapillaryZB-51511.Vazques, Aimar, et al., 201130. m/0.25 mm/0.25 μm, Nitrogen; Program: not specified
CapillaryZB-51511.Vazquez, Demmel, et al., 201130. m/0.25 mm/0.25 μm, Nitrogen; Program: not specified
CapillaryHP-5 MS1494.Liu, Chu, et al., 201030. m/0.25 mm/0.25 μm, Helium; Program: 60 0C (1 min) 10 0C/min -> 180 0C (1 min) 20 0C/min -> 280 0C (15 min)
CapillaryDB-1-MS1489.Takeoka, Hobbs, et al., 201060. m/0.25 mm/0.25 μm, Helium; Program: not specified
CapillaryDB-5 MS1495.Su, Wang, et al., 200930. m/0.25 mm/0.25 μm, Helium; Program: not specified
CapillaryHP-5 MS1499.Zellner, Amorim, et al., 200930. m/0.25 mm/0.25 μm, Helium; Program: 32 0C (1 min) 50 0C/min -> 115 0C 1.5 0C/min -> 145 0C 12 0C/min -> 240 0C (10 min)
CapillaryBPX-51497.Shellie, 20087.5 m/0.10 mm/10. μm, Helium; Program: not specified
CapillaryRTX-51503.Zachariah, Leela, et al., 200830. m/0.25 mm/0.25 μm, Helium; Program: 60 0C (5 min) 5 0C/min -> 110 0C 3 0C/min -> 220 0C (5 min)
CapillaryRTX-51500.Zachariah, Leela, et al., 200830. m/0.25 mm/0.25 μm, Helium; Program: not specified
Capillary 1492.El-Shazily, Hafez, et al., 2004Program: not specified

Normal alkane RI, polar column, custom temperature program

View large format table.

Column type Active phase I Reference Comment
CapillaryInnowax FSC1755.Akin, Saracoglu, et al., 201260. m/0.25 mm/0.25 μm, Helium; Program: 60 0C (10 min) 4 0C/min -> 220 0C (10 min) 1 oC/min -> 240 0C
CapillaryInnowax1756.Noorizadeh, Farmany, et al., 201160. m/0.25 mm/0.33 μm; Program: not specified
CapillaryHP Innowax1756.Noorizadeh and Farmany, 201060. m/0.25 mm/0.33 μm; Program: not specified
CapillaryHP-20M1738.Zellner, Amorim, et al., 200925. m/0.20 mm/0.20 μm, Helium; Program: 30 0C (1 min) 50 0C/min -> 110 0C 1.5 0C/min -> 145 0C 4 0C/min -> 220 0C (10 min)

References

Bendiabdellah, El Amine Dib, et al., 2012
Bendiabdellah, A.; El Amine Dib, M.; Djabou, N.; Allali, H.; Tabti, B.; Costa, J.; Myseli, A., Biological activities and volatile cinstituents of Daucus muricatus L. from Algeria, Chem. Centr. J., 2012, 6, 48, 1-22. [all data]

Mishra, Chaudhary, et al., 2010
Mishra, R.K.; Chaudhary, S.; Pandey, R.; Gupta, S.; Mallavarapu, G.R.; Kumar, S., Analysis of linalool content in the inflorescence (flower) essential oil and leaf oil of Lippia alba cultivar Kavach, J. Essen. Oil Res., 2010, 22, 1, 3-7, https://doi.org/10.1080/10412905.2010.9700253 . [all data]

Miyazawa, Kawauchi, et al., 2010
Miyazawa, M.; Kawauchi, Y.; Utsumi, Y.; Takahashi, T., Character impact odorants of wild edible plant - Cacalia hastata L. var. orientalis - used in Japanese traditional food, J. Oleo Sci., 2010, 59, 10, 527-533, https://doi.org/10.5650/jos.59.527 . [all data]

Bicchi, Binello, et al., 1999
Bicchi, C.; Binello, A.; D'Amato, A.; Rubiolo, P., Reliability of Van den Dool retention indices in the analysis of essential oils, J. Chromatogr. Sci., 1999, 37, 8, 288-294, https://doi.org/10.1093/chromsci/37.8.288 . [all data]