2,3,4,4-tetramethylhex-2-ene

Phase change data

Data compiled by: Thermodynamics Research Center, NIST Boulder Laboratories, Chris Muzny director

Quantity Value Units Method Reference Comment
Tboil434.KN/AStehman, Cook, et al., 1950Uncertainty assigned by TRC = 3. K

In addition to the Thermodynamics Research Center (TRC) data available from this site, much more physical and chemical property data is available from the following TRC products:

References

Stehman, Cook, et al., 1950
Stehman, C.J.; Cook, N.C.; Percival, W.C.; Whitmore, F.C., Hydrocarbons: XI synthesis of nineteen decenes, J. Am. Chem. Soc., 1950, 72, 4163-5. [all data]