3-mercapto-2-pentanone

Normal alkane RI, non-polar column, custom temperature program

Data compiled by: NIST Mass Spectrometry Data Center, William E. Wallace, director

Column type CapillaryCapillaryCapillary
Active phase Polydimethyl siloxaneMethyl SiliconeSE-54
Column length (m)
Carrier gas
Substrate
Column diameter (mm)
Phase thickness (μm)
Program 40 0C 20 0C/min -> 60 0C (5 min) 4 0C/min -> 250 0Cnot specifiednot specified
I 904.875.899.
ReferenceXu, He, et al., 2010Misharina, 1995Guth and Grosch, 1993
Comment MSDC-RI MSDC-RI MSDC-RI

References

Xu, He, et al., 2010
Xu, H.; He, W.; Liu, X.; Gao, Y., Effect of pressure on the Maillard reaction between ribose and cysteine in supercritical carbon dioxide, Czech J. Food Sci., 2010, 28, 3, 192-201. [all data]

Misharina, 1995
Misharina, T.A., Sorption regularities of sulfur- and oxygen-containing compounds in chromatography and their application in identification of volatile organic compounds, Diss. degree of Dr. Sci. (Chemistry), 1995, 52. [all data]

Guth and Grosch, 1993
Guth, H.; Grosch, W., 12-Methyltridecanal, a species-specific odorant of stewed beef, Lebensm. Wiss. Technol., 1993, 26, 2, 171-177, https://doi.org/10.1006/fstl.1993.1035 . [all data]