Peroxyundecanoic acid

Phase change data

Data compiled by: William E. Acree, Jr., James S. Chickos

Quantity Value Units Method Reference Comment
Δsub125.9 ± 3.4kJ/molMESwain, Kwan, et al., 1980Based on data from 293. - 303. K.

References

Swain, Kwan, et al., 1980
Swain, H.A.; Kwan, Chiu-Yin; Sung, Ho-Nan, Measurement of vapor pressures from 20 to 30.degree.C of long-chain peroxy acids, J. Phys. Chem., 1980, 84, 11, 1347-1349, https://doi.org/10.1021/j100448a012 . [all data]