Methyl Alcohol
- Formula: CH4O
- Molecular weight: 32.0419
- IUPAC Standard InChIKey: OKKJLVBELUTLKV-UHFFFAOYSA-N
- CAS Registry Number: 67-56-1
- Chemical structure:
- Other names: Methanol; Carbinol; Methyl hydroxide; Methylol; Monohydroxymethane; Wood alcohol; CH3OH; Colonial spirit; Columbian spirit; Hydroxymethane; Wood naphtha; Alcool methylique; Alcool metilico; Columbian spirits; Metanolo; Methylalkohol; Metylowy alkohol; Pyroxylic spirit; Wood spirit; Rcra waste number U154; UN 1230; Pyro alcohol; Spirit of wood; Bieleski's solution; NSC 85232
- Condensed phase thermochemistry data
- Phase change data
- Reaction thermochemistry data: reactions 1 to 50, reactions 51 to 100, reactions 101 to 150, reactions 151 to 200, reactions 201 to 250, reactions 251 to 300
- Henry's Law data
- IR Spectrum
- Mass spectrum (electron ionization)
- Vibrational and/or electronic energy levels
- Fluid Properties

Gas phase thermochemistry data

Data compiled as indicated in comments:
ALS - Hussein Y. Afeefy, Joel F. Liebman, and Stephen E. Stein
DRB - Donald R. Burgess, Jr.
GT - Glushko Thermocenter, Russian Academy of Sciences, Moscow
Quantity | Value | Units | Method | Reference | Comment |
---|---|---|---|---|---|
ΔfH°gas | -205. ± 10. | kJ/mol | AVG | N/A | Average of 9 values; Individual data points |
Quantity | Value | Units | Method | Reference | Comment |
ΔcH°gas | -763.68 ± 0.20 | kJ/mol | Cm | Rossini, 1932 | Flame Calorimetry; Corresponding ΔfHºgas = -201.49 kJ/mol (simple calculation by NIST; no Washburn corrections); ALS |
Constant pressure heat capacity of gas
Cp,gas (J/mol*K) | Temperature (K) | Reference | Comment |
---|---|---|---|
34.00 | 50. | Thermodynamics Research Center, 1997 | p=1 bar. Recommended entropies and heat capacities are in good agreement with other statistically calculated values [ Ivash E.V., 1955, Zhuravlev E.Z., 1959, Chen S.S., 1977, Chao J., 1986, Gurvich, Veyts, et al., 1989]. Please also see Chao J., 1986, 2.; GT |
36.95 | 100. | ||
38.64 | 150. | ||
39.71 | 200. | ||
42.59 | 273.15 | ||
44.06 ± 0.03 | 298.15 | ||
44.17 | 300. | ||
51.63 | 400. | ||
59.70 | 500. | ||
67.19 | 600. | ||
73.86 | 700. | ||
79.76 | 800. | ||
84.95 | 900. | ||
89.54 | 1000. | ||
93.57 | 1100. | ||
97.12 | 1200. | ||
100.24 | 1300. | ||
102.98 | 1400. | ||
105.40 | 1500. | ||
110.2 | 1750. | ||
113.8 | 2000. | ||
116.5 | 2250. | ||
118.6 | 2500. | ||
120. | 2750. | ||
121. | 3000. |
Constant pressure heat capacity of gas
Cp,gas (J/mol*K) | Temperature (K) | Reference | Comment |
---|---|---|---|
42.4 ± 1.3 | 279. | Stromsoe E., 1970 | Heat capacity at 279 K was obtained by thermal conductivity [ Halford J.O., 1957]. Vapor heat capacities from calorimetric measurements [ De Vries T., 1941] were converted to the ideal gas heat capacities by corrections for the gas imperfection effects [ Chen S.S., 1977, Chao J., 1986, 2]. Ideal gas heat capacities are given by [ Stromsoe E., 1970] as a linear function Cp=f1*(a+bT). This expression approximates the experimental values with the average deviation of 1.17 J/mol*K. The accuracy of the experimental heat capacities [ Stromsoe E., 1970] is estimated as less than 0.3%. Please also see De Vries T., 1941, Weltner W., 1951, Halford J.O., 1957.; GT |
48.0 ± 1.3 | 345.6 | ||
46.8 ± 1.2 | 347.35 | ||
46.1 ± 1.3 | 349.65 | ||
47.6 ± 1.2 | 356.55 | ||
46.7 ± 1.3 | 358.15 | ||
48.2 ± 1.3 | 358.85 | ||
48.8 ± 1.3 | 359.85 | ||
50.3 ± 1.3 | 368.15 | ||
49.0 ± 1.2 | 373.35 | ||
51.3 ± 1.3 | 382.15 | ||
51.1 ± 1.2 | 398.95 | ||
52.3 ± 1.3 | 401.15 | ||
51.3 ± 1.2 | 401.35 | ||
52.01 ± 0.42 | 403.2 | ||
53.2 ± 1.3 | 420.15 | ||
53.9 ± 1.2 | 431.45 | ||
54.8 ± 1.2 | 442.15 | ||
55.9 ± 1.3 | 442.65 | ||
56.0 ± 1.2 | 457.35 | ||
57.20 ± 0.42 | 464.0 | ||
57.8 ± 1.2 | 477.75 | ||
58.4 ± 1.2 | 485.05 | ||
59.5 ± 1.2 | 498.95 | ||
60.4 ± 1.3 | 521.2 | ||
61.4 ± 1.2 | 521.35 | ||
64.3 ± 1.2 | 555.95 | ||
66.4 ± 1.2 | 581.35 | ||
66.8 ± 1.2 | 585.35 |

Gas phase ion energetics data

Data evaluated as indicated in comments:
HL - Edward P. Hunter and Sharon G. Lias
L - Sharon G. Lias
Data compiled as indicated in comments:
B - John E. Bartmess
LL - Sharon G. Lias and Joel F. Liebman
LBLHLM - Sharon G. Lias, John E. Bartmess, Joel F. Liebman, John L. Holmes, Rhoda D. Levin, and W. Gary Mallard
LLK - Sharon G. Lias, Rhoda D. Levin, and Sherif A. Kafafi
RDSH - Henry M. Rosenstock, Keith Draxl, Bruce W. Steiner, and John T. Herron
Quantity | Value | Units | Method | Reference | Comment |
---|---|---|---|---|---|
IE (evaluated) | 10.84 ± 0.01 | eV | N/A | N/A | L |
Quantity | Value | Units | Method | Reference | Comment |
Proton affinity (review) | 754.3 | kJ/mol | N/A | Hunter and Lias, 1998 | HL |
Quantity | Value | Units | Method | Reference | Comment |
Gas basicity | 724.5 | kJ/mol | N/A | Hunter and Lias, 1998 | HL |
Ionization energy determinations
Appearance energy determinations
De-protonation reactions
CH3O- + =
Quantity | Value | Units | Method | Reference | Comment |
---|---|---|---|---|---|
ΔrH° | 1597. ± 8. | kJ/mol | AVG | N/A | Average of 6 values; Individual data points |
Quantity | Value | Units | Method | Reference | Comment |
ΔrG° | 1573.3 ± 2.6 | kJ/mol | H-TS | Nee, Osterwalder, et al., 2006 | gas phase; B |
ΔrG° | 1573.4 ± 2.3 | kJ/mol | H-TS | Osborn, Leahy, et al., 1998 | gas phase; B |
ΔrG° | 1565. ± 8.4 | kJ/mol | IMRE | Bartmess, Scott, et al., 1979 | gas phase; The acidity is 1.2 kcal/mol stronger than that from the D-EA cycle, due to the multi-compound fit for the acidity scale.; value altered from reference due to change in acidity scale; B |
ΔrG° | 1567. ± 8.8 | kJ/mol | H-TS | Haas and Harrison, 1993 | gas phase; Both metastable and 50 eV collision energy.; B |
ΔrG° | 1569.4 ± 2.5 | kJ/mol | TDEq | Meot-ner and Sieck, 1986 | gas phase; Experimental entropy: 21.5 eu, 0.6 less than H2O; B |

Ion clustering data

Data compiled as indicated in comments:
B - John E. Bartmess
M - Michael M. Meot-Ner (Mautner) and Sharon G. Lias
RCD - Robert C. Dunbar
Clustering reactions
By formula: Br- + CH4O = (Br- • CH4O)
Quantity | Value | Units | Method | Reference | Comment |
---|---|---|---|---|---|
ΔrH° | 60.67 ± 0.42 | kJ/mol | TDAs | Bogdanov, Peschke, et al., 1999 | gas phase; B |
ΔrH° | 58.2 ± 4.2 | kJ/mol | TDAs | Hiraoka and Yamabe, 1991 | gas phase; B,M |
Quantity | Value | Units | Method | Reference | Comment |
ΔrS° | 73.6 | J/mol*K | PHPMS | Hiraoka and Yamabe, 1991 | gas phase; M |
Quantity | Value | Units | Method | Reference | Comment |
ΔrG° | 33.5 ± 0.42 | kJ/mol | TDAs | Bogdanov, Peschke, et al., 1999 | gas phase; B |
ΔrG° | 36. ± 8.4 | kJ/mol | TDAs | Hiraoka and Yamabe, 1991 | gas phase; B |
ΔrG° | 35. ± 8.4 | kJ/mol | IMRE | Tanabe, Morgon, et al., 1996 | gas phase; Anchored to H2O..Br- of Hiraoka, Mizure, et al., 19882; B |
By formula: (Br- • CH4O) + CH4O = (Br- • 2CH4O)
Quantity | Value | Units | Method | Reference | Comment |
---|---|---|---|---|---|
ΔrH° | 50.21 ± 0.84 | kJ/mol | TDAs | Bogdanov, Peschke, et al., 1999 | gas phase; B |
ΔrH° | 52.3 ± 4.2 | kJ/mol | TDAs | Hiraoka and Yamabe, 1991 | gas phase; B,M |
Quantity | Value | Units | Method | Reference | Comment |
ΔrS° | 86.6 | J/mol*K | PHPMS | Hiraoka and Yamabe, 1991 | gas phase; M |
Quantity | Value | Units | Method | Reference | Comment |
ΔrG° | 23.5 | kJ/mol | TDAs | Bogdanov, Peschke, et al., 1999 | gas phase; B |
ΔrG° | 26. ± 8.4 | kJ/mol | TDAs | Hiraoka and Yamabe, 1991 | gas phase; B |
By formula: (Br- • 2CH4O) + CH4O = (Br- • 3CH4O)
Quantity | Value | Units | Method | Reference | Comment |
---|---|---|---|---|---|
ΔrH° | 39.7 ± 2.1 | kJ/mol | TDAs | Bogdanov, Peschke, et al., 1999 | gas phase; B |
ΔrH° | 44.4 ± 4.2 | kJ/mol | TDAs | Hiraoka and Yamabe, 1991 | gas phase; B,M |
Quantity | Value | Units | Method | Reference | Comment |
ΔrS° | 90.4 | J/mol*K | PHPMS | Hiraoka and Yamabe, 1991 | gas phase; M |
Quantity | Value | Units | Method | Reference | Comment |
ΔrG° | 17.8 | kJ/mol | TDAs | Bogdanov, Peschke, et al., 1999 | gas phase; B |
ΔrG° | 18. ± 8.4 | kJ/mol | TDAs | Hiraoka and Yamabe, 1991 | gas phase; B |
By formula: (Br- • 3CH4O) + CH4O = (Br- • 4CH4O)
Quantity | Value | Units | Method | Reference | Comment |
---|---|---|---|---|---|
ΔrH° | 41. ± 4.2 | kJ/mol | TDAs | Hiraoka and Yamabe, 1991 | gas phase; B,M |
Quantity | Value | Units | Method | Reference | Comment |
ΔrS° | 97.1 | J/mol*K | PHPMS | Hiraoka and Yamabe, 1991 | gas phase; M |
Quantity | Value | Units | Method | Reference | Comment |
ΔrG° | 13. ± 8.4 | kJ/mol | TDAs | Hiraoka and Yamabe, 1991 | gas phase; B |
By formula: (Br- • 4CH4O) + CH4O = (Br- • 5CH4O)
Quantity | Value | Units | Method | Reference | Comment |
---|---|---|---|---|---|
ΔrH° | 41. ± 4.2 | kJ/mol | TDAs | Hiraoka and Yamabe, 1991 | gas phase; B,M |
Quantity | Value | Units | Method | Reference | Comment |
ΔrS° | 105. | J/mol*K | PHPMS | Hiraoka and Yamabe, 1991 | gas phase; M |
Quantity | Value | Units | Method | Reference | Comment |
ΔrG° | 9.6 ± 8.4 | kJ/mol | TDAs | Hiraoka and Yamabe, 1991 | gas phase; B |
By formula: (Br- • 5CH4O) + CH4O = (Br- • 6CH4O)
Quantity | Value | Units | Method | Reference | Comment |
---|---|---|---|---|---|
ΔrH° | 38. ± 4.2 | kJ/mol | TDAs | Hiraoka and Yamabe, 1991 | gas phase; B,M |
Quantity | Value | Units | Method | Reference | Comment |
ΔrS° | 98.7 | J/mol*K | PHPMS | Hiraoka and Yamabe, 1991 | gas phase; M |
Quantity | Value | Units | Method | Reference | Comment |
ΔrG° | 8.8 ± 8.4 | kJ/mol | TDAs | Hiraoka and Yamabe, 1991 | gas phase; B |
By formula: (Br- • 6CH4O) + CH4O = (Br- • 7CH4O)
Quantity | Value | Units | Method | Reference | Comment |
---|---|---|---|---|---|
ΔrH° | 36. ± 4.2 | kJ/mol | TDAs | Hiraoka and Yamabe, 1991 | gas phase; B,M |
Quantity | Value | Units | Method | Reference | Comment |
ΔrS° | 95.8 | J/mol*K | PHPMS | Hiraoka and Yamabe, 1991 | gas phase; M |
Quantity | Value | Units | Method | Reference | Comment |
ΔrG° | 7.1 ± 8.4 | kJ/mol | TDAs | Hiraoka and Yamabe, 1991 | gas phase; B |
By formula: (Br- • 7CH4O) + CH4O = (Br- • 8CH4O)
Quantity | Value | Units | Method | Reference | Comment |
---|---|---|---|---|---|
ΔrH° | 35. ± 4.2 | kJ/mol | TDAs | Hiraoka and Yamabe, 1991 | gas phase; B,M |
Quantity | Value | Units | Method | Reference | Comment |
ΔrS° | 96.7 | J/mol*K | PHPMS | Hiraoka and Yamabe, 1991 | gas phase; M |
Quantity | Value | Units | Method | Reference | Comment |
ΔrG° | 6.3 ± 8.4 | kJ/mol | TDAs | Hiraoka and Yamabe, 1991 | gas phase; B |
By formula: (Br- • 8CH4O) + CH4O = (Br- • 9CH4O)
Quantity | Value | Units | Method | Reference | Comment |
---|---|---|---|---|---|
ΔrH° | 34. ± 4.2 | kJ/mol | TDAs | Hiraoka and Yamabe, 1991 | gas phase; Entropy estimated.; B,M |
Quantity | Value | Units | Method | Reference | Comment |
ΔrS° | 96. | J/mol*K | N/A | Hiraoka and Yamabe, 1991 | gas phase; Entropy change calculated or estimated; M |
Quantity | Value | Units | Method | Reference | Comment |
ΔrG° | 5.4 ± 8.4 | kJ/mol | TDAs | Hiraoka and Yamabe, 1991 | gas phase; Entropy estimated.; B |
By formula: (Br- • 9CH4O) + CH4O = (Br- • 10CH4O)
Quantity | Value | Units | Method | Reference | Comment |
---|---|---|---|---|---|
ΔrH° | 33. ± 4.2 | kJ/mol | TDAs | Hiraoka and Yamabe, 1991 | gas phase; Entropy estimated.; B,M |
Quantity | Value | Units | Method | Reference | Comment |
ΔrS° | 96. | J/mol*K | N/A | Hiraoka and Yamabe, 1991 | gas phase; Entropy change calculated or estimated; M |
Quantity | Value | Units | Method | Reference | Comment |
ΔrG° | 4.6 ± 8.4 | kJ/mol | TDAs | Hiraoka and Yamabe, 1991 | gas phase; Entropy estimated.; B |
By formula: CHO- + CH4O = (CHO- • CH4O)
Quantity | Value | Units | Method | Reference | Comment |
---|---|---|---|---|---|
ΔrH° | 120. | kJ/mol | PHPMS | Meot-ner and Sieck, 1986 | gas phase; M |
Quantity | Value | Units | Method | Reference | Comment |
ΔrS° | 112. | J/mol*K | PHPMS | Meot-ner and Sieck, 1986 | gas phase; M |
By formula: CHO2- + CH4O = (CHO2- • CH4O)
Quantity | Value | Units | Method | Reference | Comment |
---|---|---|---|---|---|
ΔrH° | 73.6 ± 4.2 | kJ/mol | N/A | Meot-Ner and Sieck, 1986 | gas phase; B,M |
Quantity | Value | Units | Method | Reference | Comment |
ΔrS° | 98.7 | J/mol*K | PHPMS | Meot-Ner and Sieck, 1986 | gas phase; M |
Quantity | Value | Units | Method | Reference | Comment |
ΔrG° | 43.9 ± 6.7 | kJ/mol | TDAs | Meot-Ner and Sieck, 1986 | gas phase; B |
By formula: CH3O- + CH4O = (CH3O- • CH4O)
Quantity | Value | Units | Method | Reference | Comment |
---|---|---|---|---|---|
ΔrH° | 123. ± 4.2 | kJ/mol | TDAs | Paul and Kebarle, 1990 | gas phase; B,M |
ΔrH° | 120.5 ± 1.3 | kJ/mol | TDAs | Meot-ner and Sieck, 1986 | gas phase; B,M |
ΔrH° | 123. ± 10. | kJ/mol | TDAs | Caldwell, Rozeboom, et al., 1984 | gas phase; Reanchored to average data from Paul and Kebarle, 1990 and Meot-ner and Sieck, 1986.; value altered from reference due to change in acidity scale; B |
ΔrH° | 79.5 ± 8.4 | kJ/mol | N/A | Moylan, Dodd, et al., 1985 | gas phase; B |
Quantity | Value | Units | Method | Reference | Comment |
ΔrS° | 133. | J/mol*K | PHPMS | Paul and Kebarle, 1990 | gas phase; M |
ΔrS° | 112. | J/mol*K | PHPMS | Meot-Ner(Mautner), 1986 | gas phase; n; M |
Quantity | Value | Units | Method | Reference | Comment |
ΔrG° | 84.94 | kJ/mol | IMRE | Mustanir, Matsuoka, et al., 2006 | gas phase; B |
ΔrG° | 82.8 ± 4.2 | kJ/mol | TDAs | Paul and Kebarle, 1990 | gas phase; B |
ΔrG° | 87.0 ± 2.1 | kJ/mol | TDAs | Meot-ner and Sieck, 1986 | gas phase; B |
ΔrG° | 84.9 ± 6.7 | kJ/mol | TDAs | Caldwell, Rozeboom, et al., 1984 | gas phase; Reanchored to average data from Paul and Kebarle, 1990 and Meot-ner and Sieck, 1986.; value altered from reference due to change in acidity scale; B |
Free energy of reaction
ΔrG° (kJ/mol) | T (K) | Method | Reference | Comment |
---|---|---|---|---|
79.9 | 296. | FA | MacKay and Bohme, 1978 | gas phase; From thermochemical cycle,switching reaction(CH3O-)H2O; Meot-Ner(Mautner), 1986; M |
By formula: (CH3O- • CH4O) + CH4O = (CH3O- • 2CH4O)
Quantity | Value | Units | Method | Reference | Comment |
---|---|---|---|---|---|
ΔrH° | 89.5 | kJ/mol | PHPMS | Meot-Ner(Mautner), 1986 | gas phase; n; M |
Quantity | Value | Units | Method | Reference | Comment |
ΔrS° | 116. | J/mol*K | PHPMS | Meot-Ner(Mautner), 1986 | gas phase; n; M |
By formula: (CH3O- • 2CH4O) + CH4O = (CH3O- • 3CH4O)
Quantity | Value | Units | Method | Reference | Comment |
---|---|---|---|---|---|
ΔrH° | 62.8 | kJ/mol | PHPMS | Meot-Ner(Mautner), 1986 | gas phase; n; M |
Quantity | Value | Units | Method | Reference | Comment |
ΔrS° | 110. | J/mol*K | PHPMS | Meot-Ner(Mautner), 1986 | gas phase; n; M |
By formula: (CH3O- • 3CH4O) + CH4O = (CH3O- • 4CH4O)
Quantity | Value | Units | Method | Reference | Comment |
---|---|---|---|---|---|
ΔrH° | 47.7 | kJ/mol | PHPMS | Meot-Ner(Mautner), 1986 | gas phase; n; M |
Quantity | Value | Units | Method | Reference | Comment |
ΔrS° | 93.7 | J/mol*K | PHPMS | Meot-Ner(Mautner), 1986 | gas phase; n; M |
By formula: (CH3O- • H2O) + CH4O = (CH3O- • CH4O • H2O)
Free energy of reaction
ΔrG° (kJ/mol) | T (K) | Method | Reference | Comment |
---|---|---|---|---|
57.3 | 296. | FA | MacKay and Bohme, 1978 | gas phase; From thermochemical cycle,switching reaction(CH3O-)2H2O; Meot-Ner(Mautner), 1986; M |
By formula: CH5O+ + CH4O = (CH5O+ • CH4O)
Bond type: Hydrogen bonds of the type OH-O between organics
Quantity | Value | Units | Method | Reference | Comment |
---|---|---|---|---|---|
ΔrH° | 136. | kJ/mol | PHPMS | Meot-Ner (Mautner), 1992 | gas phase; M |
ΔrH° | 135. | kJ/mol | PHPMS | Szulejko and McMahon, 1992 | gas phase; M |
ΔrH° | 134. | kJ/mol | PHPMS | Meot-Ner(Mautner), 1986 | gas phase; M |
ΔrH° | 138. | kJ/mol | PHPMS | Grimsrud and Kebarle, 1973 | gas phase; M |
ΔrH° | 141. | kJ/mol | ICR | Larson and McMahon, 1982 | gas phase; switching reaction((CH3)2OH+)(CH3)2O; Entropy change calculated or estimated; Grimsrud and Kebarle, 1973, Lias, Liebman, et al., 1984, Keesee and Castleman, 1986; M |
Quantity | Value | Units | Method | Reference | Comment |
ΔrS° | 121. | J/mol*K | PHPMS | Meot-Ner (Mautner), 1992 | gas phase; M |
ΔrS° | 122. | J/mol*K | PHPMS | Szulejko and McMahon, 1992 | gas phase; M |
ΔrS° | 111. | J/mol*K | PHPMS | Meot-Ner(Mautner), 1986 | gas phase; M |
ΔrS° | 128. | J/mol*K | PHPMS | Grimsrud and Kebarle, 1973 | gas phase; M |
ΔrS° | 119. | J/mol*K | N/A | Larson and McMahon, 1982 | gas phase; switching reaction((CH3)2OH+)(CH3)2O; Entropy change calculated or estimated; Grimsrud and Kebarle, 1973, Lias, Liebman, et al., 1984, Keesee and Castleman, 1986; M |
Quantity | Value | Units | Method | Reference | Comment |
ΔrG° | 105. | kJ/mol | ICR | Larson and McMahon, 1982 | gas phase; switching reaction((CH3)2OH+)(CH3)2O; Entropy change calculated or estimated; Grimsrud and Kebarle, 1973, Lias, Liebman, et al., 1984, Keesee and Castleman, 1986; M |
By formula: (CH5O+ • CH4O) + CH4O = (CH5O+ • 2CH4O)
Bond type: Hydrogen bonds of the type OH-O between organics
Quantity | Value | Units | Method | Reference | Comment |
---|---|---|---|---|---|
ΔrH° | 88.7 | kJ/mol | PHPMS | Meot-Ner (Mautner), 1992 | gas phase; M |
ΔrH° | 87.9 | kJ/mol | PHPMS | Meot-Ner(Mautner), 1986 | gas phase; M |
ΔrH° | 89.1 | kJ/mol | PHPMS | Grimsrud and Kebarle, 1973 | gas phase; M |
Quantity | Value | Units | Method | Reference | Comment |
ΔrS° | 113. | J/mol*K | PHPMS | Meot-Ner (Mautner), 1992 | gas phase; M |
ΔrS° | 108. | J/mol*K | PHPMS | Meot-Ner(Mautner), 1986 | gas phase; M |
ΔrS° | 118. | J/mol*K | PHPMS | Grimsrud and Kebarle, 1973 | gas phase; M |
By formula: (CH5O+ • 2CH4O) + CH4O = (CH5O+ • 3CH4O)
Bond type: Hydrogen bonds of the type OH-O between organics
Quantity | Value | Units | Method | Reference | Comment |
---|---|---|---|---|---|
ΔrH° | 58.6 | kJ/mol | PHPMS | Meot-Ner (Mautner), 1992 | gas phase; M |
ΔrH° | 67.4 | kJ/mol | PHPMS | Grimsrud and Kebarle, 1973 | gas phase; M |
Quantity | Value | Units | Method | Reference | Comment |
ΔrS° | 100. | J/mol*K | PHPMS | Meot-Ner (Mautner), 1992 | gas phase; M |
ΔrS° | 121. | J/mol*K | PHPMS | Grimsrud and Kebarle, 1973 | gas phase; M |
By formula: (CH5O+ • 3CH4O) + CH4O = (CH5O+ • 4CH4O)
Bond type: Hydrogen bonds of the type OH-O between organics
Quantity | Value | Units | Method | Reference | Comment |
---|---|---|---|---|---|
ΔrH° | 47.3 | kJ/mol | PHPMS | Meot-Ner (Mautner), 1992 | gas phase; M |
ΔrH° | 56.5 | kJ/mol | PHPMS | Grimsrud and Kebarle, 1973 | gas phase; M |
Quantity | Value | Units | Method | Reference | Comment |
ΔrS° | 93.3 | J/mol*K | PHPMS | Meot-Ner (Mautner), 1992 | gas phase; M |
ΔrS° | 120. | J/mol*K | PHPMS | Grimsrud and Kebarle, 1973 | gas phase; M |
By formula: (CH5O+ • 4CH4O) + CH4O = (CH5O+ • 5CH4O)
Bond type: Hydrogen bonds of the type OH-O between organics
Quantity | Value | Units | Method | Reference | Comment |
---|---|---|---|---|---|
ΔrH° | 42.7 | kJ/mol | PHPMS | Meot-Ner (Mautner), 1992 | gas phase; M |
ΔrH° | 52.3 | kJ/mol | PHPMS | Grimsrud and Kebarle, 1973 | gas phase; M |
Quantity | Value | Units | Method | Reference | Comment |
ΔrS° | 98.3 | J/mol*K | PHPMS | Meot-Ner (Mautner), 1992 | gas phase; M |
ΔrS° | 130. | J/mol*K | PHPMS | Grimsrud and Kebarle, 1973 | gas phase; M |
By formula: (CH5O+ • 5CH4O) + CH4O = (CH5O+ • 6CH4O)
Bond type: Hydrogen bonds of the type OH-O between organics
Quantity | Value | Units | Method | Reference | Comment |
---|---|---|---|---|---|
ΔrH° | 39. | kJ/mol | PHPMS | Meot-Ner (Mautner), 1992 | gas phase; M |
ΔrH° | 49.8 | kJ/mol | PHPMS | Grimsrud and Kebarle, 1973 | gas phase; M |
Quantity | Value | Units | Method | Reference | Comment |
ΔrS° | 98.3 | J/mol*K | PHPMS | Meot-Ner (Mautner), 1992 | gas phase; M |
ΔrS° | 138. | J/mol*K | PHPMS | Grimsrud and Kebarle, 1973 | gas phase; M |
By formula: (CH5O+ • 6CH4O) + CH4O = (CH5O+ • 7CH4O)
Bond type: Hydrogen bonds of the type OH-O between organics
Quantity | Value | Units | Method | Reference | Comment |
---|---|---|---|---|---|
ΔrH° | 38. | kJ/mol | PHPMS | Meot-Ner (Mautner), 1992 | gas phase; M |
ΔrH° | 50.2 | kJ/mol | PHPMS | Grimsrud and Kebarle, 1973 | gas phase; M |
Quantity | Value | Units | Method | Reference | Comment |
ΔrS° | 108. | J/mol*K | PHPMS | Meot-Ner (Mautner), 1992 | gas phase; M |
ΔrS° | 149. | J/mol*K | PHPMS | Grimsrud and Kebarle, 1973 | gas phase; M |
By formula: (CH5O+ • 7CH4O) + CH4O = (CH5O+ • 8CH4O)
Bond type: Hydrogen bonds of the type OH-O between organics
Quantity | Value | Units | Method | Reference | Comment |
---|---|---|---|---|---|
ΔrH° | 39. | kJ/mol | PHPMS | Meot-Ner (Mautner), 1992 | gas phase; M |
Quantity | Value | Units | Method | Reference | Comment |
ΔrS° | 113. | J/mol*K | PHPMS | Meot-Ner (Mautner), 1992 | gas phase; M |
By formula: (CH5O+ • 8CH4O) + CH4O = (CH5O+ • 9CH4O)
Bond type: Hydrogen bonds of the type OH-O between organics
Quantity | Value | Units | Method | Reference | Comment |
---|---|---|---|---|---|
ΔrH° | 38. | kJ/mol | PHPMS | Meot-Ner (Mautner), 1992 | gas phase; M |
Quantity | Value | Units | Method | Reference | Comment |
ΔrS° | 110. | J/mol*K | PHPMS | Meot-Ner (Mautner), 1992 | gas phase; M |
Free energy of reaction
ΔrG° (kJ/mol) | T (K) | Method | Reference | Comment |
---|---|---|---|---|
16. | 200. | PHPMS | Meot-Ner (Mautner), 1992 | gas phase; M |
By formula: (CH5O+ • 9CH4O) + CH4O = (CH5O+ • 10CH4O)
Bond type: Hydrogen bonds of the type OH-O between organics
Quantity | Value | Units | Method | Reference | Comment |
---|---|---|---|---|---|
ΔrH° | 36. | kJ/mol | PHPMS | Meot-Ner (Mautner), 1992 | gas phase; M |
Quantity | Value | Units | Method | Reference | Comment |
ΔrS° | 110. | J/mol*K | PHPMS | Meot-Ner (Mautner), 1992 | gas phase; M |
Free energy of reaction
ΔrG° (kJ/mol) | T (K) | Method | Reference | Comment |
---|---|---|---|---|
15. | 200. | PHPMS | Meot-Ner (Mautner), 1992 | gas phase; M |
By formula: (CH5O+ • 10CH4O) + CH4O = (CH5O+ • 11CH4O)
Bond type: Hydrogen bonds of the type OH-O between organics
Quantity | Value | Units | Method | Reference | Comment |
---|---|---|---|---|---|
ΔrH° | 36. | kJ/mol | PHPMS | Meot-Ner (Mautner), 1992 | gas phase; M |
Quantity | Value | Units | Method | Reference | Comment |
ΔrS° | 110. | J/mol*K | PHPMS | Meot-Ner (Mautner), 1992 | gas phase; M |
Free energy of reaction
ΔrG° (kJ/mol) | T (K) | Method | Reference | Comment |
---|---|---|---|---|
16. | 184. | PHPMS | Meot-Ner (Mautner), 1992 | gas phase; M |
By formula: (CH5O+ • 11CH4O) + CH4O = (CH5O+ • 12CH4O)
Bond type: Hydrogen bonds of the type OH-O between organics
Quantity | Value | Units | Method | Reference | Comment |
---|---|---|---|---|---|
ΔrH° | 36. | kJ/mol | PHPMS | Meot-Ner (Mautner), 1992 | gas phase; M |
Quantity | Value | Units | Method | Reference | Comment |
ΔrS° | 110. | J/mol*K | PHPMS | Meot-Ner (Mautner), 1992 | gas phase; M |
Free energy of reaction
ΔrG° (kJ/mol) | T (K) | Method | Reference | Comment |
---|---|---|---|---|
15. | 184. | PHPMS | Meot-Ner (Mautner), 1992 | gas phase; M |
By formula: (CH5O+ • 12CH4O) + CH4O = (CH5O+ • 13CH4O)
Bond type: Hydrogen bonds of the type OH-O between organics
Quantity | Value | Units | Method | Reference | Comment |
---|---|---|---|---|---|
ΔrH° | 36. | kJ/mol | PHPMS | Meot-Ner (Mautner), 1992 | gas phase; M |
Quantity | Value | Units | Method | Reference | Comment |
ΔrS° | 110. | J/mol*K | PHPMS | Meot-Ner (Mautner), 1992 | gas phase; M |
Free energy of reaction
ΔrG° (kJ/mol) | T (K) | Method | Reference | Comment |
---|---|---|---|---|
16. | 184. | PHPMS | Meot-Ner (Mautner), 1992 | gas phase; M |
(CH5O+ • • ) + = (CH5O+ • 2 • )
By formula: (CH5O+ • CH4O • H2O) + CH4O = (CH5O+ • 2CH4O • H2O)
Bond type: Hydrogen bonds of the type OH-O between organics
Quantity | Value | Units | Method | Reference | Comment |
---|---|---|---|---|---|
ΔrH° | 68.6 | kJ/mol | PHPMS | Meot-Ner(Mautner), 1986 | gas phase; n; M |
Quantity | Value | Units | Method | Reference | Comment |
ΔrS° | 111. | J/mol*K | PHPMS | Meot-Ner(Mautner), 1986 | gas phase; n; M |
By formula: (CH5O+ • H2O) + CH4O = (CH5O+ • CH4O • H2O)
Bond type: Hydrogen bonds of the type OH-O between organics
Quantity | Value | Units | Method | Reference | Comment |
---|---|---|---|---|---|
ΔrH° | 103. | kJ/mol | PHPMS | Meot-Ner(Mautner), 1986 | gas phase; n, Entropy change calculated or estimated; M |
Quantity | Value | Units | Method | Reference | Comment |
ΔrS° | 120. | J/mol*K | N/A | Meot-Ner(Mautner), 1986 | gas phase; n, Entropy change calculated or estimated; M |
Free energy of reaction
ΔrG° (kJ/mol) | T (K) | Method | Reference | Comment |
---|---|---|---|---|
48.5 | 452. | PHPMS | Meot-Ner(Mautner), 1986 | gas phase; n, Entropy change calculated or estimated; M |
By formula: (CH5O+ • 2H2O) + CH4O = (CH5O+ • CH4O • 2H2O)
Bond type: Hydrogen bonds of the type OH-O between organics
Quantity | Value | Units | Method | Reference | Comment |
---|---|---|---|---|---|
ΔrH° | 75.3 | kJ/mol | PHPMS | Meot-Ner(Mautner), 1986 | gas phase; n; M |
Quantity | Value | Units | Method | Reference | Comment |
ΔrS° | 110. | J/mol*K | PHPMS | Meot-Ner(Mautner), 1986 | gas phase; n; M |
By formula: CH6N+ + CH4O = (CH6N+ • CH4O)
Bond type: Hydrogen bonds of the type NH+-O between organics
Quantity | Value | Units | Method | Reference | Comment |
---|---|---|---|---|---|
ΔrH° | 79.5 | kJ/mol | PHPMS | Meot-Ner, 1984 | gas phase; M |
Quantity | Value | Units | Method | Reference | Comment |
ΔrS° | 101. | J/mol*K | PHPMS | Meot-Ner, 1984 | gas phase; M |
By formula: CN- + CH4O = (CN- • CH4O)
Quantity | Value | Units | Method | Reference | Comment |
---|---|---|---|---|---|
ΔrH° | 65.7 ± 3.3 | kJ/mol | TDAs | Larson, Szulejko, et al., 1988 | gas phase; B,M |
ΔrH° | 69.5 ± 4.2 | kJ/mol | TDAs | Meot-ner, 1988 | gas phase; B |
ΔrH° | 69. ± 15. | kJ/mol | IMRE | Larson and McMahon, 1987 | gas phase; B,M |
Quantity | Value | Units | Method | Reference | Comment |
ΔrS° | 96. | J/mol*K | PHPMS | Larson, Szulejko, et al., 1988 | gas phase; M |
ΔrS° | 102. | J/mol*K | N/A | Larson and McMahon, 1987 | gas phase; switching reaction,Thermochemical ladder(CN-)H2O, Entropy change calculated or estimated; Payzant, Yamdagni, et al., 1971; M |
Quantity | Value | Units | Method | Reference | Comment |
ΔrG° | 36.8 ± 0.84 | kJ/mol | TDAs | Larson, Szulejko, et al., 1988 | gas phase; B |
ΔrG° | 43.5 ± 4.2 | kJ/mol | TDAs | Meot-ner, 1988 | gas phase; B |
ΔrG° | 38. ± 9.6 | kJ/mol | IMRE | Larson and McMahon, 1987 | gas phase; B,M |
By formula: C2H- + CH4O = C3H5O-
Quantity | Value | Units | Method | Reference | Comment |
---|---|---|---|---|---|
ΔrH° | 90.4 ± 8.4 | kJ/mol | IMRE | Chabinyc and Brauman, 1999 | gas phase; Anchored to MeOH ΔGacid=375.2; B |
Quantity | Value | Units | Method | Reference | Comment |
ΔrG° | 45.61 | kJ/mol | IMRE | Mustanir, Matsuoka, et al., 2006 | gas phase; B |
ΔrG° | 48.5 ± 8.4 | kJ/mol | IMRE | Chabinyc and Brauman, 1999 | gas phase; Anchored to MeOH ΔGacid=375.2; B |
By formula: C2H3O2- + CH4O = (C2H3O2- • CH4O)
Quantity | Value | Units | Method | Reference | Comment |
---|---|---|---|---|---|
ΔrH° | 73.6 ± 4.2 | kJ/mol | TDAs | Meot-ner, 1988 | gas phase; B |
Quantity | Value | Units | Method | Reference | Comment |
ΔrG° | 43.9 ± 4.2 | kJ/mol | TDAs | Meot-ner, 1988 | gas phase; B |
By formula: (C2H4N+ • CH4O) + CH4O = (C2H4N+ • 2CH4O)
Bond type: Hydrogen bonds of the type NH+-O between organics
Quantity | Value | Units | Method | Reference | Comment |
---|---|---|---|---|---|
ΔrH° | 87.4 | kJ/mol | PHPMS | El-Shall, Olafsdottir, et al., 1991 | gas phase; M |
Quantity | Value | Units | Method | Reference | Comment |
ΔrS° | 109. | J/mol*K | PHPMS | El-Shall, Olafsdottir, et al., 1991 | gas phase; M |
By formula: (C2H4N+ • 2CH4O) + CH4O = (C2H4N+ • 3CH4O)
Bond type: Hydrogen bonds of the type NH+-O between organics
Quantity | Value | Units | Method | Reference | Comment |
---|---|---|---|---|---|
ΔrH° | 58.2 | kJ/mol | PHPMS | El-Shall, Olafsdottir, et al., 1991 | gas phase; M |
Quantity | Value | Units | Method | Reference | Comment |
ΔrS° | 102. | J/mol*K | PHPMS | El-Shall, Olafsdottir, et al., 1991 | gas phase; M |
(C2H4N+ • • ) + = (C2H4N+ • 2 • )
By formula: (C2H4N+ • CH4O • C2H3N) + CH4O = (C2H4N+ • 2CH4O • C2H3N)
Bond type: Hydrogen bonds of the type NH+-O between organics
Quantity | Value | Units | Method | Reference | Comment |
---|---|---|---|---|---|
ΔrH° | 57.3 | kJ/mol | PHPMS | El-Shall, Olafsdottir, et al., 1991 | gas phase; M |
Quantity | Value | Units | Method | Reference | Comment |
ΔrS° | 101. | J/mol*K | PHPMS | El-Shall, Olafsdottir, et al., 1991 | gas phase; M |
By formula: C2H4NO2- + CH4O = C3H8NO3-
Quantity | Value | Units | Method | Reference | Comment |
---|---|---|---|---|---|
ΔrH° | 71.1 ± 2.1 | kJ/mol | TDAs | Nieckarz, Atkins, et al., 2008 | gas phase; B |
Quantity | Value | Units | Method | Reference | Comment |
ΔrG° | 40. ± 4.2 | kJ/mol | TDAs | Nieckarz, Atkins, et al., 2008 | gas phase; B |
By formula: C2H5O+ + CH4O = (C2H5O+ • CH4O)
Bond type: Hydrogen bonds of the type OH-O between organics
Quantity | Value | Units | Method | Reference | Comment |
---|---|---|---|---|---|
ΔrH° | 127. | kJ/mol | ICR | Larson and McMahon, 1982 | gas phase; switching reaction((CH3)2OH+)(CH3)2O, Entropy change calculated or estimated; Grimsrud and Kebarle, 1973, Lias, Liebman, et al., 1984, Keesee and Castleman, 1986; M |
Quantity | Value | Units | Method | Reference | Comment |
ΔrS° | 113. | J/mol*K | N/A | Larson and McMahon, 1982 | gas phase; switching reaction((CH3)2OH+)(CH3)2O, Entropy change calculated or estimated; Grimsrud and Kebarle, 1973, Lias, Liebman, et al., 1984, Keesee and Castleman, 1986; M |
Quantity | Value | Units | Method | Reference | Comment |
ΔrG° | 93.3 | kJ/mol | ICR | Larson and McMahon, 1982 | gas phase; switching reaction((CH3)2OH+)(CH3)2O, Entropy change calculated or estimated; Grimsrud and Kebarle, 1973, Lias, Liebman, et al., 1984, Keesee and Castleman, 1986; M |
By formula: C2H5O- + CH4O = (C2H5O- • CH4O)
Quantity | Value | Units | Method | Reference | Comment |
---|---|---|---|---|---|
ΔrH° | 114. ± 12. | kJ/mol | IMRE | Caldwell, Rozeboom, et al., 1984 | gas phase; Reanchored to average data from Paul and Kebarle, 1990 and Meot-ner and Sieck, 1986.; value altered from reference due to change in acidity scale; B,M |
ΔrH° | 107. ± 7.9 | kJ/mol | CIDT | DeTuri and Ervin, 1999 | gas phase; B |
Quantity | Value | Units | Method | Reference | Comment |
ΔrS° | 123. | J/mol*K | N/A | Caldwell, Rozeboom, et al., 1984 | gas phase; switching reaction(CH3O-)CH3OH, Entropy change calculated or estimated; re-evaluated using Meot-Ner(Mautner), 1986 and Paul and Kebarle, 1990; M |
Quantity | Value | Units | Method | Reference | Comment |
ΔrG° | 77.8 ± 8.4 | kJ/mol | IMRE | Caldwell, Rozeboom, et al., 1984 | gas phase; Reanchored to average data from Paul and Kebarle, 1990 and Meot-ner and Sieck, 1986.; value altered from reference due to change in acidity scale; B,M |
Free energy of reaction
ΔrG° (kJ/mol) | T (K) | Method | Reference | Comment |
---|---|---|---|---|
56.1 | 296. | FA | Mackay, Rakshit, et al., 1982 | gas phase; From thermochemical cycle,switching reaction(CH3O-)CH3OH; Caldwell and Kebarle, 1986, Taft, 1983; M |
By formula: C2H7O+ + CH4O = (C2H7O+ • CH4O)
Bond type: Hydrogen bonds of the type OH-O between organics
Quantity | Value | Units | Method | Reference | Comment |
---|---|---|---|---|---|
ΔrH° | 110. | kJ/mol | PHPMS | Hiraoka, Grimsrud, et al., 1974 | gas phase; n; M |
Quantity | Value | Units | Method | Reference | Comment |
ΔrS° | 113. | J/mol*K | PHPMS | Hiraoka, Grimsrud, et al., 1974 | gas phase; n; M |
By formula: (C2H7O+ • CH4O) + CH4O = (C2H7O+ • 2CH4O)
Bond type: Hydrogen bonds of the type OH-O between organics
Quantity | Value | Units | Method | Reference | Comment |
---|---|---|---|---|---|
ΔrH° | 78.7 | kJ/mol | PHPMS | Hiraoka, Grimsrud, et al., 1974 | gas phase; n; M |
Quantity | Value | Units | Method | Reference | Comment |
ΔrS° | 121. | J/mol*K | PHPMS | Hiraoka, Grimsrud, et al., 1974 | gas phase; n; M |
By formula: (C2H7O+ • 2CH4O) + CH4O = (C2H7O+ • 3CH4O)
Bond type: Hydrogen bonds of the type OH-O between organics
Quantity | Value | Units | Method | Reference | Comment |
---|---|---|---|---|---|
ΔrH° | 66.5 | kJ/mol | PHPMS | Hiraoka, Grimsrud, et al., 1974 | gas phase; n; M |
Quantity | Value | Units | Method | Reference | Comment |
ΔrS° | 131. | J/mol*K | PHPMS | Hiraoka, Grimsrud, et al., 1974 | gas phase; n; M |
By formula: (C2H7O+ • 3CH4O) + CH4O = (C2H7O+ • 4CH4O)
Bond type: Hydrogen bonds of the type OH-O between organics
Quantity | Value | Units | Method | Reference | Comment |
---|---|---|---|---|---|
ΔrH° | 57.3 | kJ/mol | PHPMS | Hiraoka, Grimsrud, et al., 1974 | gas phase; n; M |
Quantity | Value | Units | Method | Reference | Comment |
ΔrS° | 129. | J/mol*K | PHPMS | Hiraoka, Grimsrud, et al., 1974 | gas phase; n; M |
(C2H7O+ • • ) + = (C2H7O+ • 2 • )
By formula: (C2H7O+ • CH4O • C2H6O) + CH4O = (C2H7O+ • 2CH4O • C2H6O)
Bond type: Hydrogen bonds of the type OH-O between organics
Quantity | Value | Units | Method | Reference | Comment |
---|---|---|---|---|---|
ΔrH° | 63.2 | kJ/mol | PHPMS | Hiraoka, Grimsrud, et al., 1974 | gas phase; n; M |
Quantity | Value | Units | Method | Reference | Comment |
ΔrS° | 128. | J/mol*K | PHPMS | Hiraoka, Grimsrud, et al., 1974 | gas phase; n; M |
(C2H7O+ • 2 • ) + = (C2H7O+ • 3 • )
By formula: (C2H7O+ • 2CH4O • C2H6O) + CH4O = (C2H7O+ • 3CH4O • C2H6O)
Bond type: Hydrogen bonds of the type OH-O between organics
Quantity | Value | Units | Method | Reference | Comment |
---|---|---|---|---|---|
ΔrH° | 51.0 | kJ/mol | PHPMS | Hiraoka, Grimsrud, et al., 1974 | gas phase; n; M |
Quantity | Value | Units | Method | Reference | Comment |
ΔrS° | 111. | J/mol*K | PHPMS | Hiraoka, Grimsrud, et al., 1974 | gas phase; n; M |
By formula: (C2H7O+ • C2H6O) + CH4O = (C2H7O+ • CH4O • C2H6O)
Bond type: Hydrogen bonds of the type OH-O between organics
Quantity | Value | Units | Method | Reference | Comment |
---|---|---|---|---|---|
ΔrH° | 75.7 | kJ/mol | PHPMS | Hiraoka, Grimsrud, et al., 1974 | gas phase; n; M |
Quantity | Value | Units | Method | Reference | Comment |
ΔrS° | 128. | J/mol*K | PHPMS | Hiraoka, Grimsrud, et al., 1974 | gas phase; n; M |
By formula: C2H7O+ + CH4O = (C2H7O+ • CH4O)
Bond type: Hydrogen bonds of the type OH-O between organics
Quantity | Value | Units | Method | Reference | Comment |
---|---|---|---|---|---|
ΔrH° | 124. | kJ/mol | ICR | Larson and McMahon, 1982 | gas phase; switching reaction((CH3)2OH+)(CH3)2O, Entropy change calculated or estimated; Grimsrud and Kebarle, 1973, Lias, Liebman, et al., 1984, Keesee and Castleman, 1986; M |
Quantity | Value | Units | Method | Reference | Comment |
ΔrS° | 111. | J/mol*K | N/A | Larson and McMahon, 1982 | gas phase; switching reaction((CH3)2OH+)(CH3)2O, Entropy change calculated or estimated; Grimsrud and Kebarle, 1973, Lias, Liebman, et al., 1984, Keesee and Castleman, 1986; M |
Quantity | Value | Units | Method | Reference | Comment |
ΔrG° | 90.8 | kJ/mol | ICR | Larson and McMahon, 1982 | gas phase; switching reaction((CH3)2OH+)(CH3)2O, Entropy change calculated or estimated; Grimsrud and Kebarle, 1973, Lias, Liebman, et al., 1984, Keesee and Castleman, 1986; M |
By formula: C2H7O2- + 2CH4O = C3H11O3-
Quantity | Value | Units | Method | Reference | Comment |
---|---|---|---|---|---|
ΔrH° | 89.5 ± 4.2 | kJ/mol | TDAs | Meot-Ner(Mautner), 1986 | gas phase; B |
Quantity | Value | Units | Method | Reference | Comment |
ΔrG° | 54.8 ± 2.1 | kJ/mol | TDAs | Meot-Ner(Mautner), 1986 | gas phase; B |
By formula: C2H7O2- + H2O + CH4O = C2H9O3-
Quantity | Value | Units | Method | Reference | Comment |
---|---|---|---|---|---|
ΔrH° | 74.5 ± 4.2 | kJ/mol | TDAs | Meot-Ner(Mautner), 1986 | gas phase; B |
Quantity | Value | Units | Method | Reference | Comment |
ΔrG° | 42.3 ± 2.1 | kJ/mol | TDAs | Meot-Ner(Mautner), 1986 | gas phase; B |
By formula: C2H9O3- + 2H2O + CH4O = C2H11O4-
Quantity | Value | Units | Method | Reference | Comment |
---|---|---|---|---|---|
ΔrH° | 63.6 ± 4.2 | kJ/mol | TDAs | Meot-Ner(Mautner), 1986 | gas phase; B |
Quantity | Value | Units | Method | Reference | Comment |
ΔrG° | 28.9 ± 2.1 | kJ/mol | TDAs | Meot-Ner(Mautner), 1986 | gas phase; B |
By formula: C3H3N2- + CH4O = (C3H3N2- • CH4O)
Quantity | Value | Units | Method | Reference | Comment |
---|---|---|---|---|---|
ΔrH° | 71.5 | kJ/mol | PHPMS | Meot-Ner (Mautner), 1988 | gas phase; M |
Quantity | Value | Units | Method | Reference | Comment |
ΔrS° | 101. | J/mol*K | PHPMS | Meot-Ner (Mautner), 1988 | gas phase; M |
By formula: C3H7O+ + CH4O = (C3H7O+ • CH4O)
Bond type: Hydrogen bonds of the type OH-O between organics
Quantity | Value | Units | Method | Reference | Comment |
---|---|---|---|---|---|
ΔrH° | 54.8 | kJ/mol | PHPMS | Meot-Ner (Mautner), Ross, et al., 1985 | gas phase; M |
Quantity | Value | Units | Method | Reference | Comment |
ΔrS° | 89.1 | J/mol*K | PHPMS | Meot-Ner (Mautner), Ross, et al., 1985 | gas phase; M |
By formula: C3H7O- + CH4O = (C3H7O- • CH4O)
Quantity | Value | Units | Method | Reference | Comment |
---|---|---|---|---|---|
ΔrH° | 113. ± 12. | kJ/mol | N/A | Caldwell, Rozeboom, et al., 1984 | gas phase; Reanchored to average data from Paul and Kebarle, 1990 and Meot-ner and Sieck, 1986.; value altered from reference due to change in acidity scale; B,M |
Quantity | Value | Units | Method | Reference | Comment |
ΔrS° | 123. | J/mol*K | N/A | Caldwell, Rozeboom, et al., 1984 | gas phase; switching reaction(CH3O-)CH3OH, Entropy change calculated or estimated; re-evaluated using Meot-Ner(Mautner), 1986 and Paul and Kebarle, 1990; M |
Quantity | Value | Units | Method | Reference | Comment |
ΔrG° | 76.1 ± 8.4 | kJ/mol | IMRE | Caldwell, Rozeboom, et al., 1984 | gas phase; Reanchored to average data from Paul and Kebarle, 1990 and Meot-ner and Sieck, 1986.; value altered from reference due to change in acidity scale; B,M |
By formula: C3H9Si+ + CH4O = (C3H9Si+ • CH4O)
Quantity | Value | Units | Method | Reference | Comment |
---|---|---|---|---|---|
ΔrH° | 164. | kJ/mol | PHPMS | Wojtyniak and Stone, 1986 | gas phase; switching reaction,Thermochemical ladder((CH3)3Si+)H2O, Entropy change calculated or estimated; M |
Quantity | Value | Units | Method | Reference | Comment |
ΔrS° | 124. | J/mol*K | N/A | Wojtyniak and Stone, 1986 | gas phase; switching reaction,Thermochemical ladder((CH3)3Si+)H2O, Entropy change calculated or estimated; M |
Free energy of reaction
ΔrG° (kJ/mol) | T (K) | Method | Reference | Comment |
---|---|---|---|---|
106. | 468. | PHPMS | Wojtyniak and Stone, 1986 | gas phase; switching reaction,Thermochemical ladder((CH3)3Si+)H2O, Entropy change calculated or estimated; M |
By formula: C3H9Sn+ + CH4O = (C3H9Sn+ • CH4O)
Quantity | Value | Units | Method | Reference | Comment |
---|---|---|---|---|---|
ΔrH° | 136. | kJ/mol | PHPMS | Stone and Splinter, 1984 | gas phase; M |
Quantity | Value | Units | Method | Reference | Comment |
ΔrS° | 130. | J/mol*K | PHPMS | Stone and Splinter, 1984 | gas phase; M |
By formula: C3H10N+ + CH4O = (C3H10N+ • CH4O)
Bond type: Hydrogen bonds of the type NH+-O between organics
Quantity | Value | Units | Method | Reference | Comment |
---|---|---|---|---|---|
ΔrH° | 63.2 | kJ/mol | PHPMS | El-Shall, Daly, et al., 1992 | gas phase; M |
Quantity | Value | Units | Method | Reference | Comment |
ΔrS° | 87.9 | J/mol*K | PHPMS | El-Shall, Daly, et al., 1992 | gas phase; M |
(C3H10N+ • ) + = (C3H10N+ • 2)
By formula: (C3H10N+ • CH4O) + CH4O = (C3H10N+ • 2CH4O)
Bond type: Hydrogen bonds of the type NH+-O between organics
Quantity | Value | Units | Method | Reference | Comment |
---|---|---|---|---|---|
ΔrH° | 49.0 | kJ/mol | PHPMS | El-Shall, Daly, et al., 1992 | gas phase; M |
Quantity | Value | Units | Method | Reference | Comment |
ΔrS° | 99.6 | J/mol*K | PHPMS | El-Shall, Daly, et al., 1992 | gas phase; M |
(C3H10N+ • 2) + = (C3H10N+ • 3)
By formula: (C3H10N+ • 2CH4O) + CH4O = (C3H10N+ • 3CH4O)
Bond type: Hydrogen bonds of the type NH+-O between organics
Quantity | Value | Units | Method | Reference | Comment |
---|---|---|---|---|---|
ΔrH° | 43.9 | kJ/mol | PHPMS | El-Shall, Daly, et al., 1992 | gas phase; M |
Quantity | Value | Units | Method | Reference | Comment |
ΔrS° | 113. | J/mol*K | PHPMS | El-Shall, Daly, et al., 1992 | gas phase; M |
(C3H10N+ • • ) + = (C3H10N+ • 2 • )
By formula: (C3H10N+ • CH4O • C3H9N) + CH4O = (C3H10N+ • 2CH4O • C3H9N)
Bond type: Hydrogen bonds of the type NH+-O between organics
Quantity | Value | Units | Method | Reference | Comment |
---|---|---|---|---|---|
ΔrH° | 40. | kJ/mol | PHPMS | El-Shall, Daly, et al., 1992 | gas phase; M |
(C3H10N+ • ) + = (C3H10N+ • • )
By formula: (C3H10N+ • C3H9N) + CH4O = (C3H10N+ • CH4O • C3H9N)
Bond type: Hydrogen bonds of the type NH+-O between organics
Quantity | Value | Units | Method | Reference | Comment |
---|---|---|---|---|---|
ΔrH° | 44.4 | kJ/mol | PHPMS | El-Shall, Daly, et al., 1992 | gas phase; M |
Quantity | Value | Units | Method | Reference | Comment |
ΔrS° | 105. | J/mol*K | PHPMS | El-Shall, Daly, et al., 1992 | gas phase; M |
By formula: C3H11O3- + 3CH4O = C4H15O4-
Quantity | Value | Units | Method | Reference | Comment |
---|---|---|---|---|---|
ΔrH° | 62.8 ± 4.2 | kJ/mol | TDAs | Meot-Ner(Mautner), 1986 | gas phase; B |
Quantity | Value | Units | Method | Reference | Comment |
ΔrG° | 30.1 ± 2.1 | kJ/mol | TDAs | Meot-Ner(Mautner), 1986 | gas phase; B |
By formula: C3H11O3- + H2O + 2CH4O = C3H13O4-
Quantity | Value | Units | Method | Reference | Comment |
---|---|---|---|---|---|
ΔrH° | 57.7 ± 4.2 | kJ/mol | TDAs | Meot-Ner(Mautner), 1986 | gas phase; B |
Quantity | Value | Units | Method | Reference | Comment |
ΔrG° | 26.8 ± 2.1 | kJ/mol | TDAs | Meot-Ner(Mautner), 1986 | gas phase; B |
By formula: C4H2O3- + CH4O = (C4H2O3- • CH4O)
Quantity | Value | Units | Method | Reference | Comment |
---|---|---|---|---|---|
ΔrG° | 20. ± 6.7 | kJ/mol | IMRE | Chowdhury, Grimsrud, et al., 1987 | gas phase; Free energy affinity at 70°C.; B |
Free energy of reaction
ΔrG° (kJ/mol) | T (K) | Method | Reference | Comment |
---|---|---|---|---|
20. | 343. | PHPMS | Chowdhury, 1987 | gas phase; M |
By formula: C4H4N- + CH4O = (C4H4N- • CH4O)
Quantity | Value | Units | Method | Reference | Comment |
---|---|---|---|---|---|
ΔrH° | 77.8 ± 4.2 | kJ/mol | TDAs | Meot-ner, 1988, 2 | gas phase; B,M |
Quantity | Value | Units | Method | Reference | Comment |
ΔrS° | 115. | J/mol*K | PHPMS | Meot-ner, 1988, 2 | gas phase; M |
Quantity | Value | Units | Method | Reference | Comment |
ΔrG° | 43.5 ± 4.2 | kJ/mol | TDAs | Meot-ner, 1988, 2 | gas phase; B |
By formula: C4H9O- + CH4O = (C4H9O- • CH4O)
Quantity | Value | Units | Method | Reference | Comment |
---|---|---|---|---|---|
ΔrH° | 107. ± 4.2 | kJ/mol | TDEq | Meot-Ner and Sieck, 1986 | gas phase; B,M |
ΔrH° | 97.9 ± 9.2 | kJ/mol | CIDT | DeTuri and Ervin, 1999 | gas phase; B |
ΔrH° | 109. ± 10. | kJ/mol | N/A | Caldwell, Rozeboom, et al., 1984 | gas phase; Reanchored to average data from Paul and Kebarle, 1990 and Meot-ner and Sieck, 1986.; B,M |
Quantity | Value | Units | Method | Reference | Comment |
ΔrS° | 117. | J/mol*K | N/A | Meot-Ner and Sieck, 1986 | gas phase; Entropy change calculated or estimated; M |
ΔrS° | 123. | J/mol*K | N/A | Caldwell, Rozeboom, et al., 1984 | gas phase; switching reaction(CH3O-)CH3OH, Entropy change calculated or estimated; re-evaluated using Meot-Ner(Mautner), 1986 and Paul and Kebarle, 1990; M |
Quantity | Value | Units | Method | Reference | Comment |
ΔrG° | 42.68 | kJ/mol | IMRE | Mustanir, Matsuoka, et al., 2006 | gas phase; B |
ΔrG° | 71.5 ± 6.7 | kJ/mol | TDEq | Meot-Ner and Sieck, 1986 | gas phase; B |
ΔrG° | 72.4 ± 6.7 | kJ/mol | IMRE | Caldwell, Rozeboom, et al., 1984 | gas phase; Reanchored to average data from Paul and Kebarle, 1990 and Meot-ner and Sieck, 1986.; B,M |
By formula: C4H11O2+ + CH4O = (C4H11O2+ • CH4O)
Bond type: Hydrogen bonds between protonated and neutral organics
Quantity | Value | Units | Method | Reference | Comment |
---|---|---|---|---|---|
ΔrH° | 92.0 | kJ/mol | PHPMS | Meot-Ner (Mautner), Sieck, et al., 1994 | gas phase; M |
Quantity | Value | Units | Method | Reference | Comment |
ΔrS° | 118. | J/mol*K | PHPMS | Meot-Ner (Mautner), Sieck, et al., 1994 | gas phase; M |
(C4H11O2+ • ) + = (C4H11O2+ • 2)
By formula: (C4H11O2+ • CH4O) + CH4O = (C4H11O2+ • 2CH4O)
Bond type: Hydrogen bonds between protonated and neutral organics
Quantity | Value | Units | Method | Reference | Comment |
---|---|---|---|---|---|
ΔrH° | 60.2 | kJ/mol | PHPMS | Meot-Ner (Mautner), Sieck, et al., 1994 | gas phase; M |
Quantity | Value | Units | Method | Reference | Comment |
ΔrS° | 98.7 | J/mol*K | PHPMS | Meot-Ner (Mautner), Sieck, et al., 1994 | gas phase; M |
(C4H11O2+ • 2) + = (C4H11O2+ • 3)
By formula: (C4H11O2+ • 2CH4O) + CH4O = (C4H11O2+ • 3CH4O)
Bond type: Hydrogen bonds between protonated and neutral organics
Quantity | Value | Units | Method | Reference | Comment |
---|---|---|---|---|---|
ΔrH° | 52.7 | kJ/mol | PHPMS | Meot-Ner (Mautner), Sieck, et al., 1994 | gas phase; M |
Quantity | Value | Units | Method | Reference | Comment |
ΔrS° | 105. | J/mol*K | PHPMS | Meot-Ner (Mautner), Sieck, et al., 1994 | gas phase; M |
(C4H11O2+ • 3) + = (C4H11O2+ • 4)
By formula: (C4H11O2+ • 3CH4O) + CH4O = (C4H11O2+ • 4CH4O)
Bond type: Hydrogen bonds between protonated and neutral organics
Quantity | Value | Units | Method | Reference | Comment |
---|---|---|---|---|---|
ΔrH° | 42.7 | kJ/mol | PHPMS | Meot-Ner (Mautner), Sieck, et al., 1994 | gas phase; M |
Quantity | Value | Units | Method | Reference | Comment |
ΔrS° | 93.3 | J/mol*K | PHPMS | Meot-Ner (Mautner), Sieck, et al., 1994 | gas phase; M |
(C4H11O2+ • 4) + = (C4H11O2+ • 5)
By formula: (C4H11O2+ • 4CH4O) + CH4O = (C4H11O2+ • 5CH4O)
Bond type: Hydrogen bonds between protonated and neutral organics
Quantity | Value | Units | Method | Reference | Comment |
---|---|---|---|---|---|
ΔrH° | 38. | kJ/mol | PHPMS | Meot-Ner (Mautner), Sieck, et al., 1994 | gas phase; M |
Quantity | Value | Units | Method | Reference | Comment |
ΔrS° | 92.9 | J/mol*K | PHPMS | Meot-Ner (Mautner), Sieck, et al., 1994 | gas phase; M |
(C4H11O2+ • 5) + = (C4H11O2+ • 6)
By formula: (C4H11O2+ • 5CH4O) + CH4O = (C4H11O2+ • 6CH4O)
Bond type: Hydrogen bonds between protonated and neutral organics
Quantity | Value | Units | Method | Reference | Comment |
---|---|---|---|---|---|
ΔrH° | 37. | kJ/mol | PHPMS | Meot-Ner (Mautner), Sieck, et al., 1994 | gas phase; M |
Quantity | Value | Units | Method | Reference | Comment |
ΔrS° | 100. | J/mol*K | PHPMS | Meot-Ner (Mautner), Sieck, et al., 1994 | gas phase; M |
By formula: C4H15O4- + 4CH4O = C5H19O5-
Quantity | Value | Units | Method | Reference | Comment |
---|---|---|---|---|---|
ΔrH° | 47.7 ± 4.2 | kJ/mol | TDAs | Meot-Ner(Mautner), 1986 | gas phase; B |
Quantity | Value | Units | Method | Reference | Comment |
ΔrG° | 19.7 ± 2.1 | kJ/mol | TDAs | Meot-Ner(Mautner), 1986 | gas phase; B |
By formula: C5H5- + CH4O = (C5H5- • CH4O)
Quantity | Value | Units | Method | Reference | Comment |
---|---|---|---|---|---|
ΔrH° | 55.2 ± 4.2 | kJ/mol | TDAs | Meot-ner, 1988, 2 | gas phase; B |
Quantity | Value | Units | Method | Reference | Comment |
ΔrG° | 29. ± 4.2 | kJ/mol | TDAs | Meot-ner, 1988, 2 | gas phase; B |
By formula: C5H11O- + CH4O = (C5H11O- • CH4O)
Quantity | Value | Units | Method | Reference | Comment |
---|---|---|---|---|---|
ΔrH° | 108. ± 12. | kJ/mol | N/A | Caldwell, Rozeboom, et al., 1984 | gas phase; Reanchored to average data from Paul and Kebarle, 1990 and Meot-ner and Sieck, 1986.; value altered from reference due to change in acidity scale; B |
Quantity | Value | Units | Method | Reference | Comment |
ΔrG° | 71.1 ± 8.4 | kJ/mol | IMRE | Caldwell, Rozeboom, et al., 1984 | gas phase; Reanchored to average data from Paul and Kebarle, 1990 and Meot-ner and Sieck, 1986.; value altered from reference due to change in acidity scale; B |
By formula: C6F4O2- + CH4O = (C6F4O2- • CH4O)
Quantity | Value | Units | Method | Reference | Comment |
---|---|---|---|---|---|
ΔrG° | 13. ± 6.7 | kJ/mol | IMRE | Chowdhury, Grimsrud, et al., 1987 | gas phase; Free energy affinity at 70°C.; B |
Free energy of reaction
ΔrG° (kJ/mol) | T (K) | Method | Reference | Comment |
---|---|---|---|---|
13. | 343. | PHPMS | Chowdhury, 1987 | gas phase; M |
C6H4ClNO2- + = (C6H4ClNO2- • )
By formula: C6H4ClNO2- + CH4O = (C6H4ClNO2- • CH4O)
Quantity | Value | Units | Method | Reference | Comment |
---|---|---|---|---|---|
ΔrG° | 23. ± 6.7 | kJ/mol | IMRE | Chowdhury, Grimsrud, et al., 1987 | gas phase; Free energy affinity at 70°C.; B |
Free energy of reaction
ΔrG° (kJ/mol) | T (K) | Method | Reference | Comment |
---|---|---|---|---|
23. | 343. | PHPMS | Chowdhury, 1987 | gas phase; M |
C6H4ClNO2- + = (C6H4ClNO2- • )
By formula: C6H4ClNO2- + CH4O = (C6H4ClNO2- • CH4O)
Quantity | Value | Units | Method | Reference | Comment |
---|---|---|---|---|---|
ΔrG° | 23. ± 6.7 | kJ/mol | IMRE | Chowdhury, Grimsrud, et al., 1987 | gas phase; Free energy affinity at 70°C.; B |
Free energy of reaction
ΔrG° (kJ/mol) | T (K) | Method | Reference | Comment |
---|---|---|---|---|
23. | 343. | PHPMS | Chowdhury, 1987 | gas phase; M |
C6H4ClNO2- + = (C6H4ClNO2- • )
By formula: C6H4ClNO2- + CH4O = (C6H4ClNO2- • CH4O)
Quantity | Value | Units | Method | Reference | Comment |
---|---|---|---|---|---|
ΔrG° | 23. ± 6.7 | kJ/mol | IMRE | Chowdhury, Grimsrud, et al., 1987 | gas phase; Free energy affinity at 70°C.; B |
Free energy of reaction
ΔrG° (kJ/mol) | T (K) | Method | Reference | Comment |
---|---|---|---|---|
23. | 343. | PHPMS | Chowdhury, 1987 | gas phase; M |
By formula: C6H4FNO2- + CH4O = (C6H4FNO2- • CH4O)
Quantity | Value | Units | Method | Reference | Comment |
---|---|---|---|---|---|
ΔrG° | 24. ± 6.7 | kJ/mol | IMRE | Chowdhury, Grimsrud, et al., 1987 | gas phase; Free energy affinity at 70°C.; B |
Free energy of reaction
ΔrG° (kJ/mol) | T (K) | Method | Reference | Comment |
---|---|---|---|---|
24. | 343. | PHPMS | Chowdhury, 1987 | gas phase; M |
By formula: C6H4FNO2- + CH4O = (C6H4FNO2- • CH4O)
Quantity | Value | Units | Method | Reference | Comment |
---|---|---|---|---|---|
ΔrG° | 25. ± 6.7 | kJ/mol | IMRE | Chowdhury, Grimsrud, et al., 1987 | gas phase; Free energy affinity at 70°C.; B |
Free energy of reaction
ΔrG° (kJ/mol) | T (K) | Method | Reference | Comment |
---|---|---|---|---|
25. | 343. | PHPMS | Chowdhury, 1987 | gas phase; M |
By formula: C6H4FNO2- + CH4O = (C6H4FNO2- • CH4O)
Quantity | Value | Units | Method | Reference | Comment |
---|---|---|---|---|---|
ΔrH° | 66.1 ± 8.4 | kJ/mol | N/A | Chowdhury, Grimsrud, et al., 1987 | gas phase; Free energy affinity at 70°C.; B,M |
Quantity | Value | Units | Method | Reference | Comment |
ΔrS° | 125. | J/mol*K | PHPMS | Chowdhury, 1987 | gas phase; M |
Quantity | Value | Units | Method | Reference | Comment |
ΔrG° | 23. ± 8.4 | kJ/mol | TDAs | Chowdhury, Grimsrud, et al., 1987 | gas phase; Free energy affinity at 70°C.; B |
By formula: C6H4NO3- + CH4O = (C6H4NO3- • CH4O)
Quantity | Value | Units | Method | Reference | Comment |
---|---|---|---|---|---|
ΔrG° | 21. ± 6.7 | kJ/mol | IMRE | Chowdhury, Grimsrud, et al., 1987 | gas phase; Free energy affinity at 70°C.; B |
By formula: C6H4NO3- + CH4O = (C6H4NO3- • CH4O)
Quantity | Value | Units | Method | Reference | Comment |
---|---|---|---|---|---|
ΔrG° | 24. ± 6.7 | kJ/mol | IMRE | Chowdhury, Grimsrud, et al., 1987 | gas phase; Free energy affinity at 70°C.; B |
By formula: C6H4N2O4- + CH4O = (C6H4N2O4- • CH4O)
Quantity | Value | Units | Method | Reference | Comment |
---|---|---|---|---|---|
ΔrG° | 9.6 ± 6.7 | kJ/mol | IMRE | Chowdhury, Grimsrud, et al., 1987 | gas phase; Free energy affinity at 70°C.; B |
Free energy of reaction
ΔrG° (kJ/mol) | T (K) | Method | Reference | Comment |
---|---|---|---|---|
9.6 | 343. | PHPMS | Chowdhury, 1987 | gas phase; M |
By formula: C6H4N2O4- + CH4O = (C6H4N2O4- • CH4O)
Quantity | Value | Units | Method | Reference | Comment |
---|---|---|---|---|---|
ΔrG° | 14. ± 6.7 | kJ/mol | IMRE | Chowdhury, Grimsrud, et al., 1987 | gas phase; Free energy affinity at 70°C.; B |
Free energy of reaction
ΔrG° (kJ/mol) | T (K) | Method | Reference | Comment |
---|---|---|---|---|
14. | 343. | PHPMS | Chowdhury, 1987 | gas phase; M |
By formula: C6H4N2O4- + CH4O = (C6H4N2O4- • CH4O)
Quantity | Value | Units | Method | Reference | Comment |
---|---|---|---|---|---|
ΔrG° | 16. ± 6.7 | kJ/mol | IMRE | Chowdhury, Grimsrud, et al., 1987 | gas phase; Free energy affinity at 70°C.; B |
Free energy of reaction
ΔrG° (kJ/mol) | T (K) | Method | Reference | Comment |
---|---|---|---|---|
16. | 343. | PHPMS | Chowdhury, 1987 | gas phase; M |
By formula: C6H4O2- + CH4O = (C6H4O2- • CH4O)
Quantity | Value | Units | Method | Reference | Comment |
---|---|---|---|---|---|
ΔrG° | 23. ± 6.7 | kJ/mol | IMRE | Chowdhury, Grimsrud, et al., 1987 | gas phase; Free energy affinity at 70°C.; B |
Free energy of reaction
ΔrG° (kJ/mol) | T (K) | Method | Reference | Comment |
---|---|---|---|---|
23. | 343. | PHPMS | Chowdhury, 1987 | gas phase; M |
By formula: C6H5NO2- + CH4O = (C6H5NO2- • CH4O)
Quantity | Value | Units | Method | Reference | Comment |
---|---|---|---|---|---|
ΔrH° | 63.18 ± 0.84 | kJ/mol | TDAs | Sieck, 1985 | gas phase; B,M |
Quantity | Value | Units | Method | Reference | Comment |
ΔrS° | 109. | J/mol*K | PHPMS | Sieck, 1985 | gas phase; M |
Quantity | Value | Units | Method | Reference | Comment |
ΔrG° | 30.5 ± 1.7 | kJ/mol | TDAs | Sieck, 1985 | gas phase; B |
ΔrG° | 26. ± 6.7 | kJ/mol | IMRE | Chowdhury, Grimsrud, et al., 1987 | gas phase; Free energy affinity at 70°C.; B |
Free energy of reaction
ΔrG° (kJ/mol) | T (K) | Method | Reference | Comment |
---|---|---|---|---|
26. | 343. | PHPMS | Chowdhury, 1987 | gas phase; M |
By formula: C6H5S- + CH4O = (C6H5S- • CH4O)
Quantity | Value | Units | Method | Reference | Comment |
---|---|---|---|---|---|
ΔrH° | 56.1 | kJ/mol | PHPMS | Sieck and Meot-ner, 1989 | gas phase; M |
Quantity | Value | Units | Method | Reference | Comment |
ΔrS° | 96.2 | J/mol*K | PHPMS | Sieck and Meot-ner, 1989 | gas phase; M |
+ = C7H9OS-
By formula: C6H5S- + CH4O = C7H9OS-
Quantity | Value | Units | Method | Reference | Comment |
---|---|---|---|---|---|
ΔrH° | 56.07 ± 0.42 | kJ/mol | TDAs | Sieck and Meot-ner, 1989 | gas phase; B |
Quantity | Value | Units | Method | Reference | Comment |
ΔrG° | 27.2 ± 1.3 | kJ/mol | TDAs | Sieck and Meot-ner, 1989 | gas phase; B |
By formula: C6H9- + CH4O = C7H13O-
Quantity | Value | Units | Method | Reference | Comment |
---|---|---|---|---|---|
ΔrH° | 87.0 ± 8.4 | kJ/mol | IMRE | Chabinyc and Brauman, 1999 | gas phase; Anchored to MeOH ΔGacid=375.2; B |
Quantity | Value | Units | Method | Reference | Comment |
ΔrG° | 48.12 | kJ/mol | IMRE | Mustanir, Matsuoka, et al., 2006 | gas phase; B |
ΔrG° | 44.8 ± 8.4 | kJ/mol | IMRE | Chabinyc and Brauman, 1999 | gas phase; Anchored to MeOH ΔGacid=375.2; B |
By formula: C6H11S2- + CH4O = (C6H11S2- • CH4O)
Quantity | Value | Units | Method | Reference | Comment |
---|---|---|---|---|---|
ΔrH° | 92. ± 10. | kJ/mol | N/A | Caldwell, Rozeboom, et al., 1984 | gas phase; Reanchored to average data from Paul and Kebarle, 1990 and Meot-ner and Sieck, 1986.; value altered from reference due to change in acidity scale; B |
Quantity | Value | Units | Method | Reference | Comment |
ΔrG° | 55.2 ± 6.7 | kJ/mol | IMRE | Caldwell, Rozeboom, et al., 1984 | gas phase; Reanchored to average data from Paul and Kebarle, 1990 and Meot-ner and Sieck, 1986.; value altered from reference due to change in acidity scale; B |
By formula: C7F14- + CH4O = (C7F14- • CH4O)
Free energy of reaction
ΔrG° (kJ/mol) | T (K) | Method | Reference | Comment |
---|---|---|---|---|
27. | 308. | PHPMS | Knighton, Zook, et al., 1990 | gas phase; M |
C7H4F3NO2- + = (C7H4F3NO2- • )
By formula: C7H4F3NO2- + CH4O = (C7H4F3NO2- • CH4O)
Quantity | Value | Units | Method | Reference | Comment |
---|---|---|---|---|---|
ΔrH° | 61.1 ± 8.4 | kJ/mol | N/A | Chowdhury, Grimsrud, et al., 1987 | gas phase; Free energy affinity at 70°C.; B |
Quantity | Value | Units | Method | Reference | Comment |
ΔrG° | 21. ± 6.7 | kJ/mol | TDAs | Chowdhury, Grimsrud, et al., 1987 | gas phase; Free energy affinity at 70°C.; B |
By formula: C7H4N2O2- + CH4O = (C7H4N2O2- • CH4O)
Quantity | Value | Units | Method | Reference | Comment |
---|---|---|---|---|---|
ΔrG° | 20. ± 6.7 | kJ/mol | IMRE | Chowdhury, Grimsrud, et al., 1987 | gas phase; Free energy affinity at 70°C.; B |
Free energy of reaction
ΔrG° (kJ/mol) | T (K) | Method | Reference | Comment |
---|---|---|---|---|
20. | 343. | PHPMS | Chowdhury, 1987 | gas phase; M |
By formula: C7H4N2O2- + CH4O = (C7H4N2O2- • CH4O)
Quantity | Value | Units | Method | Reference | Comment |
---|---|---|---|---|---|
ΔrG° | 19. ± 6.7 | kJ/mol | IMRE | Chowdhury, Grimsrud, et al., 1987 | gas phase; Free energy affinity at 70°C.; B |
Free energy of reaction
ΔrG° (kJ/mol) | T (K) | Method | Reference | Comment |
---|---|---|---|---|
19. | 343. | PHPMS | Chowdhury, 1987 | gas phase; M |
By formula: C7H4N2O2- + CH4O = (C7H4N2O2- • CH4O)
Quantity | Value | Units | Method | Reference | Comment |
---|---|---|---|---|---|
ΔrH° | 58.2 ± 8.4 | kJ/mol | N/A | Chowdhury, Grimsrud, et al., 1987 | gas phase; Free energy affinity at 70°C.; B,M |
Quantity | Value | Units | Method | Reference | Comment |
ΔrS° | 120. | J/mol*K | PHPMS | Chowdhury, 1987 | gas phase; M |
Quantity | Value | Units | Method | Reference | Comment |
ΔrG° | 17. ± 8.4 | kJ/mol | TDAs | Chowdhury, Grimsrud, et al., 1987 | gas phase; Free energy affinity at 70°C.; B |
By formula: C7H7NO2- + CH4O = (C7H7NO2- • CH4O)
Quantity | Value | Units | Method | Reference | Comment |
---|---|---|---|---|---|
ΔrG° | 26. ± 6.7 | kJ/mol | IMRE | Chowdhury, Grimsrud, et al., 1987 | gas phase; Free energy affinity at 70°C.; B |
Free energy of reaction
ΔrG° (kJ/mol) | T (K) | Method | Reference | Comment |
---|---|---|---|---|
26. | 343. | PHPMS | Chowdhury, 1987 | gas phase; M |
By formula: C7H7NO2- + CH4O = (C7H7NO2- • CH4O)
Quantity | Value | Units | Method | Reference | Comment |
---|---|---|---|---|---|
ΔrG° | 27. ± 6.7 | kJ/mol | IMRE | Chowdhury, Grimsrud, et al., 1987 | gas phase; Free energy affinity at 70°C.; B |
Free energy of reaction
ΔrG° (kJ/mol) | T (K) | Method | Reference | Comment |
---|---|---|---|---|
27. | 343. | PHPMS | Chowdhury, 1987 | gas phase; M |
By formula: C7H7NO2- + CH4O = (C7H7NO2- • CH4O)
Quantity | Value | Units | Method | Reference | Comment |
---|---|---|---|---|---|
ΔrG° | 27. ± 6.7 | kJ/mol | IMRE | Chowdhury, Grimsrud, et al., 1987 | gas phase; Free energy affinity at 70°C.; B |
By formula: C7H7NO3- + CH4O = (C7H7NO3- • CH4O)
Quantity | Value | Units | Method | Reference | Comment |
---|---|---|---|---|---|
ΔrG° | 26. ± 6.7 | kJ/mol | IMRE | Chowdhury, Grimsrud, et al., 1987 | gas phase; Free energy affinity at 70°C.; B |
Free energy of reaction
ΔrG° (kJ/mol) | T (K) | Method | Reference | Comment |
---|---|---|---|---|
26. | 343. | PHPMS | Chowdhury, 1987 | gas phase; M |
By formula: C7H7NO3- + CH4O = (C7H7NO3- • CH4O)
Quantity | Value | Units | Method | Reference | Comment |
---|---|---|---|---|---|
ΔrH° | 59.8 ± 8.4 | kJ/mol | N/A | Chowdhury, Grimsrud, et al., 1987 | gas phase; Free energy affinity at 70°C.; B,M |
Quantity | Value | Units | Method | Reference | Comment |
ΔrS° | 97.9 | J/mol*K | PHPMS | Chowdhury, 1987 | gas phase; M |
Quantity | Value | Units | Method | Reference | Comment |
ΔrG° | 26. ± 8.4 | kJ/mol | TDAs | Chowdhury, Grimsrud, et al., 1987 | gas phase; Free energy affinity at 70°C.; B |
By formula: C8H5- + CH4O = (C8H5- • CH4O)
Quantity | Value | Units | Method | Reference | Comment |
---|---|---|---|---|---|
ΔrH° | 90.0 ± 8.4 | kJ/mol | IMRE | Chabinyc and Brauman, 1999 | gas phase; B |
ΔrH° | 90. ± 12. | kJ/mol | N/A | Caldwell, Rozeboom, et al., 1984 | gas phase; Reanchored to average data from Paul and Kebarle, 1990 and Meot-ner and Sieck, 1986.; value altered from reference due to change in acidity scale; B,M |
Quantity | Value | Units | Method | Reference | Comment |
ΔrS° | 123. | J/mol*K | N/A | Caldwell, Rozeboom, et al., 1984 | gas phase; switching reaction(CH3O-)CH3OH, Entropy change calculated or estimated; re-evaluated using Meot-Ner(Mautner), 1986 and Paul and Kebarle, 1990; M |
Quantity | Value | Units | Method | Reference | Comment |
ΔrG° | 46.0 ± 8.4 | kJ/mol | IMRE | Chabinyc and Brauman, 1999 | gas phase; B |
ΔrG° | 53.1 ± 8.4 | kJ/mol | IMRE | Caldwell, Rozeboom, et al., 1984 | gas phase; Reanchored to average data from Paul and Kebarle, 1990 and Meot-ner and Sieck, 1986.; value altered from reference due to change in acidity scale; B,M |
By formula: C8H9NO2- + CH4O = (C8H9NO2- • CH4O)
Quantity | Value | Units | Method | Reference | Comment |
---|---|---|---|---|---|
ΔrG° | 26. ± 6.7 | kJ/mol | IMRE | Chowdhury, Grimsrud, et al., 1987 | gas phase; Free energy affinity at 70°C.; B |
Free energy of reaction
ΔrG° (kJ/mol) | T (K) | Method | Reference | Comment |
---|---|---|---|---|
26. | 343. | PHPMS | Chowdhury, 1987 | gas phase; M |
By formula: C8H17O4+ + CH4O = (C8H17O4+ • CH4O)
Bond type: Hydrogen bonds with polydentate bonding in positive ions
Quantity | Value | Units | Method | Reference | Comment |
---|---|---|---|---|---|
ΔrH° | 81.6 | kJ/mol | PHPMS | Sharma and Kebarle, 1984 | gas phase; M |
Quantity | Value | Units | Method | Reference | Comment |
ΔrS° | 142. | J/mol*K | PHPMS | Sharma and Kebarle, 1984 | gas phase; M |
By formula: C9H7- + CH4O = C10H11O-
Quantity | Value | Units | Method | Reference | Comment |
---|---|---|---|---|---|
ΔrH° | 90.4 ± 8.4 | kJ/mol | IMRE | Chabinyc and Brauman, 1999 | gas phase; Anchored to MeOH ΔGacid=375.2; B |
Quantity | Value | Units | Method | Reference | Comment |
ΔrG° | 42.68 | kJ/mol | IMRE | Mustanir, Matsuoka, et al., 2006 | gas phase; B |
ΔrG° | 46.4 ± 8.4 | kJ/mol | IMRE | Chabinyc and Brauman, 1999 | gas phase; Anchored to MeOH ΔGacid=375.2; B |
C10H4Cl2O2- + = (C10H4Cl2O2- • )
By formula: C10H4Cl2O2- + CH4O = (C10H4Cl2O2- • CH4O)
Quantity | Value | Units | Method | Reference | Comment |
---|---|---|---|---|---|
ΔrG° | <6.3 ± 6.7 | kJ/mol | IMRE | Chowdhury, Grimsrud, et al., 1987 | gas phase; Free energy affinity at 70°C.; B |
Free energy of reaction
ΔrG° (kJ/mol) | T (K) | Method | Reference | Comment |
---|---|---|---|---|
6.3 | 343. | PHPMS | Chowdhury, 1987 | gas phase; DG<; M |
By formula: C10H6O2- + CH4O = (C10H6O2- • CH4O)
Quantity | Value | Units | Method | Reference | Comment |
---|---|---|---|---|---|
ΔrG° | 19. ± 6.7 | kJ/mol | IMRE | Chowdhury, Grimsrud, et al., 1987 | gas phase; Free energy affinity at 70°C.; B |
Free energy of reaction
ΔrG° (kJ/mol) | T (K) | Method | Reference | Comment |
---|---|---|---|---|
19. | 343. | PHPMS | Chowdhury, 1987 | gas phase; M |
By formula: C10H21O5+ + CH4O = (C10H21O5+ • CH4O)
Bond type: Hydrogen bonds with polydentate bonding in positive ions
Quantity | Value | Units | Method | Reference | Comment |
---|---|---|---|---|---|
ΔrH° | 83.7 | kJ/mol | PHPMS | Sharma and Kebarle, 1984 | gas phase; M |
Quantity | Value | Units | Method | Reference | Comment |
ΔrS° | 117. | J/mol*K | PHPMS | Sharma and Kebarle, 1984 | gas phase; M |
By formula: C12H25O6+ + CH4O = (C12H25O6+ • CH4O)
Bond type: Hydrogen bonds with polydentate bonding in positive ions
Quantity | Value | Units | Method | Reference | Comment |
---|---|---|---|---|---|
ΔrH° | 83.7 | kJ/mol | PHPMS | Sharma and Kebarle, 1984 | gas phase; M |
Quantity | Value | Units | Method | Reference | Comment |
ΔrS° | 123. | J/mol*K | PHPMS | Sharma and Kebarle, 1984 | gas phase; M |
By formula: Cl- + CH4O = (Cl- • CH4O)
Quantity | Value | Units | Method | Reference | Comment |
---|---|---|---|---|---|
ΔrH° | 69. ± 10. | kJ/mol | AVG | N/A | Average of 8 values; Individual data points |
Quantity | Value | Units | Method | Reference | Comment |
ΔrS° | 94.6 | J/mol*K | HPMS | Evans and Keesee, 1991 | gas phase; M |
ΔrS° | 101. | J/mol*K | PHPMS | Hiraoka and Mizuse, 1987 | gas phase; M |
ΔrS° | 92.0 | J/mol*K | PHPMS | Sieck, 1985 | gas phase; M |
ΔrS° | 95.8 | J/mol*K | N/A | Larson and McMahon, 1984 | gas phase; switching reaction(Cl-)t-C4H9OH, Entropy change calculated or estimated; French, Ikuta, et al., 1982; M |
ΔrS° | 61.9 | J/mol*K | PHPMS | Yamdagni, Payzant, et al., 1973 | gas phase; Entropy change is questionable; M |
Quantity | Value | Units | Method | Reference | Comment |
ΔrG° | 42. ± 3. | kJ/mol | AVG | N/A | Average of 10 values; Individual data points |
By formula: (Cl- • CH4O) + CH4O = (Cl- • 2CH4O)
Quantity | Value | Units | Method | Reference | Comment |
---|---|---|---|---|---|
ΔrH° | 59.0 ± 1.7 | kJ/mol | TDAs | Bogdanov, Peschke, et al., 1999 | gas phase; B |
ΔrH° | 57.32 ± 0.84 | kJ/mol | TDAs | Evans and Keesee, 1991 | gas phase; B,M |
ΔrH° | 59.0 ± 4.2 | kJ/mol | TDAs | Hiraoka and Mizuse, 1987 | gas phase; B,M |
ΔrH° | 54.4 ± 2.9 | kJ/mol | TDAs | Yamdagni, Payzant, et al., 1973 | gas phase; B,M |
Quantity | Value | Units | Method | Reference | Comment |
ΔrS° | 101. | J/mol*K | PHPMS | Hiraoka and Mizuse, 1987 | gas phase; M |
ΔrS° | 92.0 | J/mol*K | HPMS | Evans and Keesee, 1991 | gas phase; M |
ΔrS° | 81.2 | J/mol*K | PHPMS | Yamdagni, Payzant, et al., 1973 | gas phase; M |
Quantity | Value | Units | Method | Reference | Comment |
ΔrG° | 30.5 | kJ/mol | TDAs | Bogdanov, Peschke, et al., 1999 | gas phase; B |
ΔrG° | 29.7 | kJ/mol | TDAs | Evans and Keesee, 1991 | gas phase; B |
ΔrG° | 28. ± 4.2 | kJ/mol | TDAs | Hiraoka and Mizuse, 1987 | gas phase; B |
ΔrG° | 30.1 ± 1.7 | kJ/mol | TDAs | Yamdagni, Payzant, et al., 1973 | gas phase; B |
By formula: (Cl- • 2CH4O) + CH4O = (Cl- • 3CH4O)
Quantity | Value | Units | Method | Reference | Comment |
---|---|---|---|---|---|
ΔrH° | 48.12 ± 0.84 | kJ/mol | TDAs | Bogdanov, Peschke, et al., 1999 | gas phase; B |
ΔrH° | 45.2 ± 1.3 | kJ/mol | TDAs | Evans and Keesee, 1991 | gas phase; B,M |
ΔrH° | 49.4 ± 4.2 | kJ/mol | TDAs | Hiraoka and Mizuse, 1987 | gas phase; B,M |
ΔrH° | 51.5 ± 2.5 | kJ/mol | N/A | Yamdagni, Payzant, et al., 1973 | gas phase; B,M |
Quantity | Value | Units | Method | Reference | Comment |
ΔrS° | 95.8 | J/mol*K | PHPMS | Hiraoka and Mizuse, 1987 | gas phase; M |
ΔrS° | 95.0 | J/mol*K | HPMS | Evans and Keesee, 1991 | gas phase; M |
ΔrS° | 98.7 | J/mol*K | PHPMS | Yamdagni, Payzant, et al., 1973 | gas phase; M |
Quantity | Value | Units | Method | Reference | Comment |
ΔrG° | 21.2 | kJ/mol | TDAs | Bogdanov, Peschke, et al., 1999 | gas phase; B |
ΔrG° | 16.7 | kJ/mol | TDAs | Evans and Keesee, 1991 | gas phase; B |
ΔrG° | 21. ± 4.2 | kJ/mol | TDAs | Hiraoka and Mizuse, 1987 | gas phase; B |
ΔrG° | 21.8 ± 1.3 | kJ/mol | TDAs | Yamdagni, Payzant, et al., 1973 | gas phase; B |
By formula: (Cl- • 3CH4O) + CH4O = (Cl- • 4CH4O)
Quantity | Value | Units | Method | Reference | Comment |
---|---|---|---|---|---|
ΔrH° | 43.9 ± 4.2 | kJ/mol | TDAs | Hiraoka and Mizuse, 1987 | gas phase; B,M |
ΔrH° | 43.93 | kJ/mol | TDAs | Evans and Keesee, 1991 | gas phase; B |
ΔrH° | 46.9 ± 2.5 | kJ/mol | TDAs | Yamdagni, Payzant, et al., 1973 | gas phase; B,M |
Quantity | Value | Units | Method | Reference | Comment |
ΔrS° | 95.8 | J/mol*K | PHPMS | Hiraoka and Mizuse, 1987 | gas phase; M |
ΔrS° | 110. | J/mol*K | PHPMS | Yamdagni, Payzant, et al., 1973 | gas phase; M |
Quantity | Value | Units | Method | Reference | Comment |
ΔrG° | 15. ± 4.2 | kJ/mol | TDAs | Hiraoka and Mizuse, 1987 | gas phase; B |
ΔrG° | 15.5 | kJ/mol | TDAs | Evans and Keesee, 1991 | gas phase; B |
ΔrG° | 13.8 ± 0.84 | kJ/mol | TDAs | Yamdagni, Payzant, et al., 1973 | gas phase; B |
By formula: (Cl- • 4CH4O) + CH4O = (Cl- • 5CH4O)
Quantity | Value | Units | Method | Reference | Comment |
---|---|---|---|---|---|
ΔrH° | 38. ± 4.2 | kJ/mol | TDAs | Hiraoka and Mizuse, 1987 | gas phase; B,M |
ΔrH° | 43.9 ± 2.1 | kJ/mol | N/A | Yamdagni, Payzant, et al., 1973 | gas phase; B,M |
Quantity | Value | Units | Method | Reference | Comment |
ΔrS° | 90.8 | J/mol*K | PHPMS | Hiraoka and Mizuse, 1987 | gas phase; M |
ΔrS° | 107. | J/mol*K | PHPMS | Yamdagni, Payzant, et al., 1973 | gas phase; M |
Quantity | Value | Units | Method | Reference | Comment |
ΔrG° | 11. ± 4.2 | kJ/mol | TDAs | Hiraoka and Mizuse, 1987 | gas phase; B |
ΔrG° | 12.1 ± 0.42 | kJ/mol | TDAs | Yamdagni, Payzant, et al., 1973 | gas phase; B |
By formula: (Cl- • 5CH4O) + CH4O = (Cl- • 6CH4O)
Quantity | Value | Units | Method | Reference | Comment |
---|---|---|---|---|---|
ΔrH° | 37. ± 4.2 | kJ/mol | TDAs | Hiraoka and Mizuse, 1987 | gas phase; B,M |
Quantity | Value | Units | Method | Reference | Comment |
ΔrS° | 92.9 | J/mol*K | PHPMS | Hiraoka and Mizuse, 1987 | gas phase; M |
Quantity | Value | Units | Method | Reference | Comment |
ΔrG° | 9.2 ± 4.2 | kJ/mol | TDAs | Hiraoka and Mizuse, 1987 | gas phase; B |
By formula: (Cl- • 6CH4O) + CH4O = (Cl- • 7CH4O)
Quantity | Value | Units | Method | Reference | Comment |
---|---|---|---|---|---|
ΔrH° | 33. ± 4.2 | kJ/mol | TDAs | Hiraoka and Mizuse, 1987 | gas phase; B,M |
Quantity | Value | Units | Method | Reference | Comment |
ΔrS° | 84.1 | J/mol*K | PHPMS | Hiraoka and Mizuse, 1987 | gas phase; M |
Quantity | Value | Units | Method | Reference | Comment |
ΔrG° | 8.4 ± 4.2 | kJ/mol | TDAs | Hiraoka and Mizuse, 1987 | gas phase; B |
By formula: (Cl- • 7CH4O) + CH4O = (Cl- • 8CH4O)
Quantity | Value | Units | Method | Reference | Comment |
---|---|---|---|---|---|
ΔrH° | 32. ± 4.2 | kJ/mol | TDAs | Hiraoka and Mizuse, 1987 | gas phase; B,M |
Quantity | Value | Units | Method | Reference | Comment |
ΔrS° | 82.4 | J/mol*K | PHPMS | Hiraoka and Mizuse, 1987 | gas phase; M |
Quantity | Value | Units | Method | Reference | Comment |
ΔrG° | 7.1 ± 4.2 | kJ/mol | TDAs | Hiraoka and Mizuse, 1987 | gas phase; B |
By formula: (Cl- • 8CH4O) + CH4O = (Cl- • 9CH4O)
Quantity | Value | Units | Method | Reference | Comment |
---|---|---|---|---|---|
ΔrH° | 32. ± 4.2 | kJ/mol | TDAs | Hiraoka and Mizuse, 1987 | gas phase; B,M |
Quantity | Value | Units | Method | Reference | Comment |
ΔrS° | 86.2 | J/mol*K | PHPMS | Hiraoka and Mizuse, 1987 | gas phase; M |
Quantity | Value | Units | Method | Reference | Comment |
ΔrG° | 5.9 ± 4.2 | kJ/mol | TDAs | Hiraoka and Mizuse, 1987 | gas phase; B |
By formula: (Cl- • 9CH4O) + CH4O = (Cl- • 10CH4O)
Quantity | Value | Units | Method | Reference | Comment |
---|---|---|---|---|---|
ΔrH° | 31. ± 4.2 | kJ/mol | TDAs | Hiraoka and Mizuse, 1987 | gas phase; B,M |
Quantity | Value | Units | Method | Reference | Comment |
ΔrS° | 84.1 | J/mol*K | PHPMS | Hiraoka and Mizuse, 1987 | gas phase; M |
Quantity | Value | Units | Method | Reference | Comment |
ΔrG° | 5.9 ± 4.2 | kJ/mol | TDAs | Hiraoka and Mizuse, 1987 | gas phase; B |
By formula: (Cl- • 10CH4O) + CH4O = (Cl- • 11CH4O)
Quantity | Value | Units | Method | Reference | Comment |
---|---|---|---|---|---|
ΔrH° | 31. ± 4.2 | kJ/mol | TDAs | Hiraoka and Mizuse, 1987 | gas phase; Estimated entropy; single temperature measurement; B,M |
Quantity | Value | Units | Method | Reference | Comment |
ΔrS° | 84. | J/mol*K | N/A | Hiraoka and Mizuse, 1987 | gas phase; Entropy change calculated or estimated; M |
Quantity | Value | Units | Method | Reference | Comment |
ΔrG° | 5.4 ± 4.2 | kJ/mol | TDAs | Hiraoka and Mizuse, 1987 | gas phase; Estimated entropy; single temperature measurement; B |
By formula: (Cl- • CH4O • H2O) + CH4O = (Cl- • 2CH4O • H2O)
Quantity | Value | Units | Method | Reference | Comment |
---|---|---|---|---|---|
ΔrH° | 45.2 | kJ/mol | HPMS | Evans and Keesee, 1991 | gas phase; M |
Quantity | Value | Units | Method | Reference | Comment |
ΔrS° | 79. | J/mol*K | HPMS | Evans and Keesee, 1991 | gas phase; M |
By formula: (Cl- • H2O) + CH4O = (Cl- • CH4O • H2O)
Quantity | Value | Units | Method | Reference | Comment |
---|---|---|---|---|---|
ΔrH° | 55.2 | kJ/mol | HPMS | Evans and Keesee, 1991 | gas phase; M |
Quantity | Value | Units | Method | Reference | Comment |
ΔrS° | 87.4 | J/mol*K | HPMS | Evans and Keesee, 1991 | gas phase; M |
By formula: (Cl- • 2H2O) + CH4O = (Cl- • CH4O • 2H2O)
Quantity | Value | Units | Method | Reference | Comment |
---|---|---|---|---|---|
ΔrH° | 47.7 | kJ/mol | HPMS | Evans and Keesee, 1991 | gas phase; M |
Quantity | Value | Units | Method | Reference | Comment |
ΔrS° | 75.7 | J/mol*K | HPMS | Evans and Keesee, 1991 | gas phase; M |
By formula: Co+ + CH4O = (Co+ • CH4O)
Quantity | Value | Units | Method | Reference | Comment |
---|---|---|---|---|---|
ΔrH° | 148. ± 7.9 | kJ/mol | CIDT | Rodgers and Armentrout, 2000 | RCD |
By formula: Cu+ + CH4O = (Cu+ • CH4O)
Quantity | Value | Units | Method | Reference | Comment |
---|---|---|---|---|---|
ΔrH° | 56.1 | kJ/mol | HPMS | El-Shall, Schriver, et al., 1989 | gas phase; Entropy change calculated or estimated, Cu+ from laser desorption; M |
Quantity | Value | Units | Method | Reference | Comment |
ΔrS° | 100. | J/mol*K | N/A | El-Shall, Schriver, et al., 1989 | gas phase; Entropy change calculated or estimated, Cu+ from laser desorption; M |
Quantity | Value | Units | Method | Reference | Comment |
ΔrG° | 25. | kJ/mol | HPMS | El-Shall, Schriver, et al., 1989 | gas phase; Entropy change calculated or estimated, Cu+ from laser desorption; M |
By formula: (Cu+ • CH4O) + CH4O = (Cu+ • 2CH4O)
Quantity | Value | Units | Method | Reference | Comment |
---|---|---|---|---|---|
ΔrH° | 57.7 | kJ/mol | HPMS | El-Shall, Schriver, et al., 1989 | gas phase; Entropy change calculated or estimated, Cu+ from laser desorption; M |
Quantity | Value | Units | Method | Reference | Comment |
ΔrS° | 100. | J/mol*K | N/A | El-Shall, Schriver, et al., 1989 | gas phase; Entropy change calculated or estimated, Cu+ from laser desorption; M |
Quantity | Value | Units | Method | Reference | Comment |
ΔrG° | 26. | kJ/mol | HPMS | El-Shall, Schriver, et al., 1989 | gas phase; Entropy change calculated or estimated, Cu+ from laser desorption; M |
+ = CH3D4FO-
By formula: F- + CH4O = CH3D4FO-
Quantity | Value | Units | Method | Reference | Comment |
---|---|---|---|---|---|
ΔrH° | 125. ± 8.4 | kJ/mol | TDEq | Wilkinson, Szulejko, et al., 1992 | gas phase; Reported relative to ROH..F-, 0.5 kcal/mol weaker.; B |
Quantity | Value | Units | Method | Reference | Comment |
ΔrG° | 93.7 ± 8.4 | kJ/mol | TDEq | Wilkinson, Szulejko, et al., 1992 | gas phase; Reported relative to ROH..F-, 0.5 kcal/mol weaker.; B |
By formula: F- + CH4O = (F- • CH4O)
Quantity | Value | Units | Method | Reference | Comment |
---|---|---|---|---|---|
ΔrH° | 124. ± 8.4 | kJ/mol | IMRE | Larson and McMahon, 1983 | gas phase; B,M |
ΔrH° | 123. ± 9.2 | kJ/mol | CIDT | DeTuri and Ervin, 1999 | gas phase; B |
ΔrH° | 97.5 ± 8.4 | kJ/mol | TDAs | Hiraoka and Yamabe, 1991 | gas phase; B,M |
Quantity | Value | Units | Method | Reference | Comment |
ΔrS° | 105. | J/mol*K | PHPMS | Hiraoka and Yamabe, 1991 | gas phase; M |
ΔrS° | 94.6 | J/mol*K | N/A | Larson and McMahon, 1983 | gas phase; switching reaction(F-)H2O, Entropy change calculated or estimated; Arshadi, Yamdagni, et al., 1970; M |
Quantity | Value | Units | Method | Reference | Comment |
ΔrG° | 95.4 ± 8.4 | kJ/mol | IMRE | Larson and McMahon, 1983 | gas phase; B,M |
ΔrG° | 66.1 ± 8.4 | kJ/mol | TDAs | Hiraoka and Yamabe, 1991 | gas phase; B |
By formula: (F- • CH4O) + CH4O = (F- • 2CH4O)
Quantity | Value | Units | Method | Reference | Comment |
---|---|---|---|---|---|
ΔrH° | 84.9 ± 1.3 | kJ/mol | TDAs | Bogdanov, Peschke, et al., 1999 | gas phase; B |
ΔrH° | 80.8 ± 4.2 | kJ/mol | TDAs | Hiraoka and Yamabe, 1991 | gas phase; B,M |
Quantity | Value | Units | Method | Reference | Comment |
ΔrS° | 97.1 | J/mol*K | PHPMS | Hiraoka and Yamabe, 1991 | gas phase; M |
Quantity | Value | Units | Method | Reference | Comment |
ΔrG° | 54.27 | kJ/mol | TDAs | Bogdanov, Peschke, et al., 1999 | gas phase; B |
ΔrG° | 51.9 ± 8.4 | kJ/mol | TDAs | Hiraoka and Yamabe, 1991 | gas phase; B |
By formula: (F- • 2CH4O) + CH4O = (F- • 3CH4O)
Quantity | Value | Units | Method | Reference | Comment |
---|---|---|---|---|---|
ΔrH° | 63.2 ± 2.5 | kJ/mol | TDAs | Bogdanov, Peschke, et al., 1999 | gas phase; B |
ΔrH° | 60.7 ± 4.2 | kJ/mol | TDAs | Hiraoka and Yamabe, 1991 | gas phase; B,M |
Quantity | Value | Units | Method | Reference | Comment |
ΔrS° | 88.7 | J/mol*K | PHPMS | Hiraoka and Yamabe, 1991 | gas phase; M |
Quantity | Value | Units | Method | Reference | Comment |
ΔrG° | 33.7 | kJ/mol | TDAs | Bogdanov, Peschke, et al., 1999 | gas phase; B |
ΔrG° | 34. ± 8.4 | kJ/mol | TDAs | Hiraoka and Yamabe, 1991 | gas phase; B |
By formula: (F- • 3CH4O) + CH4O = (F- • 4CH4O)
Quantity | Value | Units | Method | Reference | Comment |
---|---|---|---|---|---|
ΔrH° | 52.3 ± 4.2 | kJ/mol | TDAs | Hiraoka and Yamabe, 1991 | gas phase; B,M |
Quantity | Value | Units | Method | Reference | Comment |
ΔrS° | 98.3 | J/mol*K | PHPMS | Hiraoka and Yamabe, 1991 | gas phase; M |
Quantity | Value | Units | Method | Reference | Comment |
ΔrG° | 23. ± 8.4 | kJ/mol | TDAs | Hiraoka and Yamabe, 1991 | gas phase; B |
By formula: (F- • 4CH4O) + CH4O = (F- • 5CH4O)
Quantity | Value | Units | Method | Reference | Comment |
---|---|---|---|---|---|
ΔrH° | 49.8 ± 4.2 | kJ/mol | TDAs | Hiraoka and Yamabe, 1991 | gas phase; B,M |
Quantity | Value | Units | Method | Reference | Comment |
ΔrS° | 114. | J/mol*K | PHPMS | Hiraoka and Yamabe, 1991 | gas phase; M |
Quantity | Value | Units | Method | Reference | Comment |
ΔrG° | 16. ± 8.4 | kJ/mol | TDAs | Hiraoka and Yamabe, 1991 | gas phase; B |
By formula: (F- • 5CH4O) + CH4O = (F- • 6CH4O)
Quantity | Value | Units | Method | Reference | Comment |
---|---|---|---|---|---|
ΔrH° | 48.1 ± 4.2 | kJ/mol | TDAs | Hiraoka and Yamabe, 1991 | gas phase; B,M |
Quantity | Value | Units | Method | Reference | Comment |
ΔrS° | 125. | J/mol*K | PHPMS | Hiraoka and Yamabe, 1991 | gas phase; M |
Quantity | Value | Units | Method | Reference | Comment |
ΔrG° | 11. ± 8.4 | kJ/mol | TDAs | Hiraoka and Yamabe, 1991 | gas phase; B |
By formula: (F- • 6CH4O) + CH4O = (F- • 7CH4O)
Quantity | Value | Units | Method | Reference | Comment |
---|---|---|---|---|---|
ΔrH° | 41. ± 4.2 | kJ/mol | TDAs | Hiraoka and Yamabe, 1991 | gas phase; B,M |
Quantity | Value | Units | Method | Reference | Comment |
ΔrS° | 107. | J/mol*K | PHPMS | Hiraoka and Yamabe, 1991 | gas phase; M |
Quantity | Value | Units | Method | Reference | Comment |
ΔrG° | 9.2 ± 8.4 | kJ/mol | TDAs | Hiraoka and Yamabe, 1991 | gas phase; B |
By formula: (F- • 7CH4O) + CH4O = (F- • 8CH4O)
Quantity | Value | Units | Method | Reference | Comment |
---|---|---|---|---|---|
ΔrH° | 41. ± 4.2 | kJ/mol | TDAs | Hiraoka and Yamabe, 1991 | gas phase; B,M |
Quantity | Value | Units | Method | Reference | Comment |
ΔrS° | 112. | J/mol*K | PHPMS | Hiraoka and Yamabe, 1991 | gas phase; M |
Quantity | Value | Units | Method | Reference | Comment |
ΔrG° | 7.1 ± 8.4 | kJ/mol | TDAs | Hiraoka and Yamabe, 1991 | gas phase; B |
By formula: (F- • 8CH4O) + CH4O = (F- • 9CH4O)
Quantity | Value | Units | Method | Reference | Comment |
---|---|---|---|---|---|
ΔrH° | 38. ± 4.2 | kJ/mol | TDAs | Hiraoka and Yamabe, 1991 | gas phase; B,M |
Quantity | Value | Units | Method | Reference | Comment |
ΔrS° | 108. | J/mol*K | PHPMS | Hiraoka and Yamabe, 1991 | gas phase; M |
Quantity | Value | Units | Method | Reference | Comment |
ΔrG° | 6.3 ± 8.4 | kJ/mol | TDAs | Hiraoka and Yamabe, 1991 | gas phase; B |
By formula: (F- • 9CH4O) + CH4O = (F- • 10CH4O)
Quantity | Value | Units | Method | Reference | Comment |
---|---|---|---|---|---|
ΔrH° | 37. ± 4.2 | kJ/mol | TDAs | Hiraoka and Yamabe, 1991 | gas phase; B,M |
Quantity | Value | Units | Method | Reference | Comment |
ΔrS° | 105. | J/mol*K | PHPMS | Hiraoka and Yamabe, 1991 | gas phase; M |
Quantity | Value | Units | Method | Reference | Comment |
ΔrG° | 5.4 ± 8.4 | kJ/mol | TDAs | Hiraoka and Yamabe, 1991 | gas phase; B |
By formula: (F- • 10CH4O) + CH4O = (F- • 11CH4O)
Quantity | Value | Units | Method | Reference | Comment |
---|---|---|---|---|---|
ΔrH° | 36. ± 4.2 | kJ/mol | TDAs | Hiraoka and Yamabe, 1991 | gas phase; B,M |
Quantity | Value | Units | Method | Reference | Comment |
ΔrS° | 107. | J/mol*K | PHPMS | Hiraoka and Yamabe, 1991 | gas phase; M |
Quantity | Value | Units | Method | Reference | Comment |
ΔrG° | 4.2 ± 8.4 | kJ/mol | TDAs | Hiraoka and Yamabe, 1991 | gas phase; B |
By formula: (F- • 11CH4O) + CH4O = (F- • 12CH4O)
Quantity | Value | Units | Method | Reference | Comment |
---|---|---|---|---|---|
ΔrH° | 36. ± 4.2 | kJ/mol | TDAs | Hiraoka and Yamabe, 1991 | gas phase; Entropy estimated.; B,M |
Quantity | Value | Units | Method | Reference | Comment |
ΔrS° | 100. | J/mol*K | N/A | Hiraoka and Yamabe, 1991 | gas phase; Entropy change calculated or estimated; M |
Quantity | Value | Units | Method | Reference | Comment |
ΔrG° | 4.6 ± 8.4 | kJ/mol | TDAs | Hiraoka and Yamabe, 1991 | gas phase; Entropy estimated.; B |
By formula: F6S- + CH4O = (F6S- • CH4O)
Free energy of reaction
ΔrG° (kJ/mol) | T (K) | Method | Reference | Comment |
---|---|---|---|---|
19. | 308. | PHPMS | Knighton, Zook, et al., 1990 | gas phase; M |
By formula: HS- + CH4O = (HS- • CH4O)
Quantity | Value | Units | Method | Reference | Comment |
---|---|---|---|---|---|
ΔrH° | 71.1 ± 4.2 | kJ/mol | TDAs | Meot-ner, 1988 | gas phase; B |
Quantity | Value | Units | Method | Reference | Comment |
ΔrG° | 46.0 ± 4.2 | kJ/mol | TDAs | Meot-ner, 1988 | gas phase; B |
By formula: H4ClO2- + CH4O + 2H2O = CH8ClO3-
Quantity | Value | Units | Method | Reference | Comment |
---|---|---|---|---|---|
ΔrH° | 43.51 ± 0.84 | kJ/mol | TDAs | Evans and Keesee, 1991 | gas phase; B |
ΔrH° | 47.7 ± 1.3 | kJ/mol | TDAs | Evans and Keesee, 1991 | gas phase; For solvation by MeOH of core ion; B |
Quantity | Value | Units | Method | Reference | Comment |
ΔrG° | 24.3 | kJ/mol | TDAs | Evans and Keesee, 1991 | gas phase; B |
ΔrG° | 25.1 | kJ/mol | TDAs | Evans and Keesee, 1991 | gas phase; For solvation by MeOH of core ion; B |
By formula: I- + CH4O = (I- • CH4O)
Quantity | Value | Units | Method | Reference | Comment |
---|---|---|---|---|---|
ΔrH° | 49.79 ± 0.84 | kJ/mol | TDAs | Bogdanov, Peschke, et al., 1999 | gas phase; B |
ΔrH° | 47.3 ± 4.2 | kJ/mol | TDAs | Caldwell and Kebarle, 1984 | gas phase; B,M |
ΔrH° | 46.9 | kJ/mol | PHPMS | Hiraoka and Yamabe, 1991 | gas phase; M |
ΔrH° | 46. | kJ/mol | PHPMS | Caldwell, Masucci, et al., 1989 | gas phase; M |
Quantity | Value | Units | Method | Reference | Comment |
ΔrS° | 71.5 | J/mol*K | PHPMS | Hiraoka and Yamabe, 1991 | gas phase; M |
ΔrS° | 74.5 | J/mol*K | PHPMS | Caldwell and Kebarle, 1984 | gas phase; M |
Quantity | Value | Units | Method | Reference | Comment |
ΔrG° | 24.1 | kJ/mol | TDAs | Bogdanov, Peschke, et al., 1999 | gas phase; B |
ΔrG° | 25. ± 4.2 | kJ/mol | TDAs | Caldwell and Kebarle, 1984 | gas phase; B |
ΔrG° | 24. ± 8.4 | kJ/mol | IMRE | Tanabe, Morgon, et al., 1996 | gas phase; Anchored to H2O..I- of Caldwell and Kebarle, 1984; B |
By formula: (I- • CH4O) + CH4O = (I- • 2CH4O)
Quantity | Value | Units | Method | Reference | Comment |
---|---|---|---|---|---|
ΔrH° | 39.7 ± 0.84 | kJ/mol | TDAs | Bogdanov, Peschke, et al., 1999 | gas phase; B |
ΔrH° | 46.4 ± 4.2 | kJ/mol | TDAs | Hiraoka and Yamabe, 1991 | gas phase; B,M |
Quantity | Value | Units | Method | Reference | Comment |
ΔrS° | 94.6 | J/mol*K | PHPMS | Hiraoka and Yamabe, 1991 | gas phase; M |
Quantity | Value | Units | Method | Reference | Comment |
ΔrG° | 17.8 | kJ/mol | TDAs | Bogdanov, Peschke, et al., 1999 | gas phase; B |
ΔrG° | 18. ± 8.4 | kJ/mol | TDAs | Hiraoka and Yamabe, 1991 | gas phase; B |
By formula: (I- • 2CH4O) + CH4O = (I- • 3CH4O)
Quantity | Value | Units | Method | Reference | Comment |
---|---|---|---|---|---|
ΔrH° | 32.2 ± 2.5 | kJ/mol | TDAs | Bogdanov, Peschke, et al., 1999 | gas phase; B |
ΔrH° | 41. ± 4.2 | kJ/mol | TDAs | Hiraoka and Yamabe, 1991 | gas phase; B,M |
Quantity | Value | Units | Method | Reference | Comment |
ΔrS° | 93.7 | J/mol*K | PHPMS | Hiraoka and Yamabe, 1991 | gas phase; M |
Quantity | Value | Units | Method | Reference | Comment |
ΔrG° | 14.3 | kJ/mol | TDAs | Bogdanov, Peschke, et al., 1999 | gas phase; B |
ΔrG° | 13. ± 8.4 | kJ/mol | TDAs | Hiraoka and Yamabe, 1991 | gas phase; B |
By formula: (I- • 3CH4O) + CH4O = (I- • 4CH4O)
Quantity | Value | Units | Method | Reference | Comment |
---|---|---|---|---|---|
ΔrH° | 41. ± 4.2 | kJ/mol | TDAs | Hiraoka and Yamabe, 1991 | gas phase; B,M |
Quantity | Value | Units | Method | Reference | Comment |
ΔrS° | 104. | J/mol*K | PHPMS | Hiraoka and Yamabe, 1991 | gas phase; M |
Quantity | Value | Units | Method | Reference | Comment |
ΔrG° | 9.6 ± 8.4 | kJ/mol | TDAs | Hiraoka and Yamabe, 1991 | gas phase; B |
By formula: (I- • 4CH4O) + CH4O = (I- • 5CH4O)
Quantity | Value | Units | Method | Reference | Comment |
---|---|---|---|---|---|
ΔrH° | 40. ± 4.2 | kJ/mol | TDAs | Hiraoka and Yamabe, 1991 | gas phase; B,M |
Quantity | Value | Units | Method | Reference | Comment |
ΔrS° | 113. | J/mol*K | PHPMS | Hiraoka and Yamabe, 1991 | gas phase; M |
Quantity | Value | Units | Method | Reference | Comment |
ΔrG° | 6.3 ± 8.4 | kJ/mol | TDAs | Hiraoka and Yamabe, 1991 | gas phase; B |
By formula: (I- • 5CH4O) + CH4O = (I- • 6CH4O)
Quantity | Value | Units | Method | Reference | Comment |
---|---|---|---|---|---|
ΔrH° | 40. ± 4.2 | kJ/mol | TDAs | Hiraoka and Yamabe, 1991 | gas phase; B,M |
Quantity | Value | Units | Method | Reference | Comment |
ΔrS° | 115. | J/mol*K | PHPMS | Hiraoka and Yamabe, 1991 | gas phase; M |
Quantity | Value | Units | Method | Reference | Comment |
ΔrG° | 5.9 ± 8.4 | kJ/mol | TDAs | Hiraoka and Yamabe, 1991 | gas phase; B |
By formula: (I- • 6CH4O) + CH4O = (I- • 7CH4O)
Quantity | Value | Units | Method | Reference | Comment |
---|---|---|---|---|---|
ΔrH° | 39. ± 4.2 | kJ/mol | TDAs | Hiraoka and Yamabe, 1991 | gas phase; B,M |
Quantity | Value | Units | Method | Reference | Comment |
ΔrS° | 117. | J/mol*K | PHPMS | Hiraoka and Yamabe, 1991 | gas phase; M |
Quantity | Value | Units | Method | Reference | Comment |
ΔrG° | 4.6 ± 8.4 | kJ/mol | TDAs | Hiraoka and Yamabe, 1991 | gas phase; B |
By formula: (I- • 7CH4O) + CH4O = (I- • 8CH4O)
Quantity | Value | Units | Method | Reference | Comment |
---|---|---|---|---|---|
ΔrH° | 38. ± 4.2 | kJ/mol | TDAs | Hiraoka and Yamabe, 1991 | gas phase; Entropy estimated.; B,M |
Quantity | Value | Units | Method | Reference | Comment |
ΔrS° | 120. | J/mol*K | N/A | Hiraoka and Yamabe, 1991 | gas phase; Entropy change calculated or estimated; M |
Quantity | Value | Units | Method | Reference | Comment |
ΔrG° | 3. ± 8.4 | kJ/mol | TDAs | Hiraoka and Yamabe, 1991 | gas phase; Entropy estimated.; B |
By formula: K+ + CH4O = (K+ • CH4O)
Quantity | Value | Units | Method | Reference | Comment |
---|---|---|---|---|---|
ΔrH° | 91.6 | kJ/mol | HPMS | Evans and Keesee, 1991 | gas phase; switching reaction,n(K+)H2O; M |
Quantity | Value | Units | Method | Reference | Comment |
ΔrS° | 132. | J/mol*K | HPMS | Evans and Keesee, 1991 | gas phase; switching reaction,n(K+)H2O; M |
By formula: (K+ • CH4O) + CH4O = (K+ • 2CH4O)
Quantity | Value | Units | Method | Reference | Comment |
---|---|---|---|---|---|
ΔrH° | 75.3 | kJ/mol | HPMS | Evans and Keesee, 1991 | gas phase; M |
Quantity | Value | Units | Method | Reference | Comment |
ΔrS° | 150. | J/mol*K | HPMS | Evans and Keesee, 1991 | gas phase; M |
By formula: (K+ • 2CH4O) + CH4O = (K+ • 3CH4O)
Quantity | Value | Units | Method | Reference | Comment |
---|---|---|---|---|---|
ΔrH° | 60.7 | kJ/mol | HPMS | Evans and Keesee, 1991 | gas phase; M |
Quantity | Value | Units | Method | Reference | Comment |
ΔrS° | 120. | J/mol*K | HPMS | Evans and Keesee, 1991 | gas phase; M |
By formula: (K+ • 3CH4O) + CH4O = (K+ • 4CH4O)
Quantity | Value | Units | Method | Reference | Comment |
---|---|---|---|---|---|
ΔrH° | 52.3 | kJ/mol | HPMS | Evans and Keesee, 1991 | gas phase; M |
Quantity | Value | Units | Method | Reference | Comment |
ΔrS° | 120. | J/mol*K | HPMS | Evans and Keesee, 1991 | gas phase; M |
By formula: (K+ • CH4O • H2O) + CH4O = (K+ • 2CH4O • H2O)
Quantity | Value | Units | Method | Reference | Comment |
---|---|---|---|---|---|
ΔrH° | 56.5 | kJ/mol | HPMS | Evans and Keesee, 1991 | gas phase; M |
Quantity | Value | Units | Method | Reference | Comment |
ΔrS° | 114. | J/mol*K | HPMS | Evans and Keesee, 1991 | gas phase; M |
By formula: (K+ • 2CH4O • H2O) + CH4O = (K+ • 3CH4O • H2O)
Quantity | Value | Units | Method | Reference | Comment |
---|---|---|---|---|---|
ΔrH° | 52.3 | kJ/mol | HPMS | Evans and Keesee, 1991 | gas phase; M |
Quantity | Value | Units | Method | Reference | Comment |
ΔrS° | 107. | J/mol*K | HPMS | Evans and Keesee, 1991 | gas phase; M |
By formula: (K+ • H2O) + CH4O = (K+ • CH4O • H2O)
Quantity | Value | Units | Method | Reference | Comment |
---|---|---|---|---|---|
ΔrH° | 82.0 | kJ/mol | HPMS | Evans and Keesee, 1991 | gas phase; M |
Quantity | Value | Units | Method | Reference | Comment |
ΔrS° | 136. | J/mol*K | HPMS | Evans and Keesee, 1991 | gas phase; M |
By formula: (K+ • 2H2O) + CH4O = (K+ • CH4O • 2H2O)
Quantity | Value | Units | Method | Reference | Comment |
---|---|---|---|---|---|
ΔrH° | 69.5 | kJ/mol | HPMS | Evans and Keesee, 1991 | gas phase; switching reaction,n(K+)3H2O; M |
Quantity | Value | Units | Method | Reference | Comment |
ΔrS° | 129. | J/mol*K | HPMS | Evans and Keesee, 1991 | gas phase; switching reaction,n(K+)3H2O; M |
By formula: Li+ + CH4O = (Li+ • CH4O)
Quantity | Value | Units | Method | Reference | Comment |
---|---|---|---|---|---|
ΔrH° | 154. ± 7.9 | kJ/mol | CIDT | Rodgers and Armentrout, 2000 | RCD |
ΔrH° | 159. | kJ/mol | ICR | Woodin and Beauchamp, 1978 | gas phase; switching reaction(Li+)H20, Entropy change calculated or estimated; Dzidic and Kebarle, 1970 interpolated; M |
ΔrH° | 160. | kJ/mol | ICR | Staley and Beauchamp, 1975 | gas phase; switching reaction(Li+)H2O, from graph; Dzidic and Kebarle, 1970 extrapolated; M |
Quantity | Value | Units | Method | Reference | Comment |
ΔrS° | 110. | J/mol*K | N/A | Woodin and Beauchamp, 1978 | gas phase; switching reaction(Li+)H20, Entropy change calculated or estimated; Dzidic and Kebarle, 1970 interpolated; M |
Quantity | Value | Units | Method | Reference | Comment |
ΔrG° | 127. | kJ/mol | ICR | Woodin and Beauchamp, 1978 | gas phase; switching reaction(Li+)H20, Entropy change calculated or estimated; Dzidic and Kebarle, 1970 interpolated; M |
By formula: Mg+ + CH4O = (Mg+ • CH4O)
Quantity | Value | Units | Method | Reference | Comment |
---|---|---|---|---|---|
ΔrH° | 145. ± 6.7 | kJ/mol | CIDT | Andersen, Muntean, et al., 2000 | RCD |
ΔrH° | 260. ± 20. | kJ/mol | PDiss | Operti, Tews, et al., 1988 | gas phase; M |
By formula: (Mg+ • CH4O) + CH4O = (Mg+ • 2CH4O)
Quantity | Value | Units | Method | Reference | Comment |
---|---|---|---|---|---|
ΔrH° | 120. ± 6.7 | kJ/mol | CIDT | Andersen, Muntean, et al., 2000 | RCD |
By formula: (Mg+ • 2CH4O) + CH4O = (Mg+ • 3CH4O)
Quantity | Value | Units | Method | Reference | Comment |
---|---|---|---|---|---|
ΔrH° | 91.6 ± 8.8 | kJ/mol | CIDT | Andersen, Muntean, et al., 2000 | RCD |
By formula: NO2- + CH4O = (NO2- • CH4O)
Quantity | Value | Units | Method | Reference | Comment |
---|---|---|---|---|---|
ΔrH° | 72.80 ± 0.84 | kJ/mol | TDAs | Sieck, 1985 | gas phase; B,M |
Quantity | Value | Units | Method | Reference | Comment |
ΔrS° | 108. | J/mol*K | PHPMS | Sieck, 1985 | gas phase; M |
Quantity | Value | Units | Method | Reference | Comment |
ΔrG° | 40.6 ± 1.7 | kJ/mol | TDAs | Sieck, 1985 | gas phase; B |
By formula: Na+ + CH4O = (Na+ • CH4O)
Quantity | Value | Units | Method | Reference | Comment |
---|---|---|---|---|---|
ΔrH° | 97.1 ± 5.4 | kJ/mol | CIDC | Amicangelo and Armentrout, 2001 | Anchor NH3=24.41; RCD |
ΔrH° | 91.6 ± 5.9 | kJ/mol | CIDT | Armentrout and Rodgers, 2000 | RCD |
ΔrH° | 100. ± 0.8 | kJ/mol | HPMS | Hoyau, Norrman, et al., 1999 | RCD |
ΔrH° | 111. ± 0.8 | kJ/mol | HPMS | Guo, Conklin, et al., 1989 | gas phase; M |
Quantity | Value | Units | Method | Reference | Comment |
ΔrS° | 85800. | J/mol*K | HPMS | Hoyau, Norrman, et al., 1999 | RCD |
ΔrS° | 102. | J/mol*K | HPMS | Guo, Conklin, et al., 1989 | gas phase; M |
Free energy of reaction
ΔrG° (kJ/mol) | T (K) | Method | Reference | Comment |
---|---|---|---|---|
72.4 | 298. | IMRE | McMahon and Ohanessian, 2000 | Anchor alanine=39.89; RCD |
By formula: (Na+ • CH4O) + CH4O = (Na+ • 2CH4O)
Quantity | Value | Units | Method | Reference | Comment |
---|---|---|---|---|---|
ΔrH° | 85.8 ± 5.9 | kJ/mol | CIDC | Amicangelo and Armentrout, 2001 | Anchor NH3=24.41; RCD |
ΔrH° | 89.5 ± 6.7 | kJ/mol | CIDC | Amicangelo and Armentrout, 2001 | Anchor NH3=24.41; RCD |
ΔrH° | 85.8 ± 6.7 | kJ/mol | CIDC | Amicangelo and Armentrout, 2001 | Anchor NH3=24.41; RCD |
ΔrH° | 84.5 ± 0.8 | kJ/mol | HPMS | Guo, Conklin, et al., 1989 | gas phase; M |
Quantity | Value | Units | Method | Reference | Comment |
ΔrS° | 90.8 | J/mol*K | HPMS | Guo, Conklin, et al., 1989 | gas phase; M |
By formula: (Na+ • 2CH4O) + CH4O = (Na+ • 3CH4O)
Quantity | Value | Units | Method | Reference | Comment |
---|---|---|---|---|---|
ΔrH° | 73. ± 2. | kJ/mol | HPMS | Guo, Conklin, et al., 1989 | gas phase; M |
Quantity | Value | Units | Method | Reference | Comment |
ΔrS° | 105. | J/mol*K | HPMS | Guo, Conklin, et al., 1989 | gas phase; M |
By formula: (Na+ • 3CH4O) + CH4O = (Na+ • 4CH4O)
Quantity | Value | Units | Method | Reference | Comment |
---|---|---|---|---|---|
ΔrH° | 65.7 ± 0.8 | kJ/mol | HPMS | Guo, Conklin, et al., 1989 | gas phase; M |
Quantity | Value | Units | Method | Reference | Comment |
ΔrS° | 126. | J/mol*K | HPMS | Guo, Conklin, et al., 1989 | gas phase; M |
By formula: O2- + CH4O = (O2- • CH4O)
Quantity | Value | Units | Method | Reference | Comment |
---|---|---|---|---|---|
ΔrH° | 79.91 | kJ/mol | TDAs | Yamdagni, Payzant, et al., 1973 | gas phase; B,M |
Quantity | Value | Units | Method | Reference | Comment |
ΔrS° | 91.6 | J/mol*K | PHPMS | Yamdagni, Payzant, et al., 1973 | gas phase; M |
Quantity | Value | Units | Method | Reference | Comment |
ΔrG° | 52.30 | kJ/mol | TDAs | Yamdagni, Payzant, et al., 1973 | gas phase; B |
By formula: (O2- • CH4O) + CH4O = (O2- • 2CH4O)
Quantity | Value | Units | Method | Reference | Comment |
---|---|---|---|---|---|
ΔrH° | 64.9 ± 3.3 | kJ/mol | TDAs | Yamdagni, Payzant, et al., 1973 | gas phase; B,M |
Quantity | Value | Units | Method | Reference | Comment |
ΔrS° | 104. | J/mol*K | PHPMS | Yamdagni, Payzant, et al., 1973 | gas phase; M |
Quantity | Value | Units | Method | Reference | Comment |
ΔrG° | 33.9 ± 1.7 | kJ/mol | TDAs | Yamdagni, Payzant, et al., 1973 | gas phase; B |
By formula: (O2- • 2CH4O) + CH4O = (O2- • 3CH4O)
Quantity | Value | Units | Method | Reference | Comment |
---|---|---|---|---|---|
ΔrH° | 56.5 ± 2.9 | kJ/mol | TDAs | Yamdagni, Payzant, et al., 1973 | gas phase; B,M |
Quantity | Value | Units | Method | Reference | Comment |
ΔrS° | 117. | J/mol*K | PHPMS | Yamdagni, Payzant, et al., 1973 | gas phase; M |
Quantity | Value | Units | Method | Reference | Comment |
ΔrG° | 21.8 ± 1.3 | kJ/mol | TDAs | Yamdagni, Payzant, et al., 1973 | gas phase; B |
By formula: Pb+ + CH4O = (Pb+ • CH4O)
Quantity | Value | Units | Method | Reference | Comment |
---|---|---|---|---|---|
ΔrH° | 97.5 ± 0.8 | kJ/mol | HPMS | Guo and Castleman, 1990 | gas phase; M |
Quantity | Value | Units | Method | Reference | Comment |
ΔrS° | 97.5 | J/mol*K | HPMS | Guo and Castleman, 1990 | gas phase; M |
By formula: (Pb+ • CH4O) + CH4O = (Pb+ • 2CH4O)
Quantity | Value | Units | Method | Reference | Comment |
---|---|---|---|---|---|
ΔrH° | 72. ± 1. | kJ/mol | HPMS | Guo and Castleman, 1990 | gas phase; M |
Quantity | Value | Units | Method | Reference | Comment |
ΔrS° | 111. | J/mol*K | HPMS | Guo and Castleman, 1990 | gas phase; M |

Kovats' RI, non-polar column, isothermal

Column type | Active phase | Temperature (C) | I | Reference | Comment |
---|---|---|---|---|---|
Capillary | SE-30 | 140. | 340. | Haken and Korhonen, 1985 | Column length: 25. m; Column diameter: 0.33 mm |
Packed | SE-30 | 100. | 384. | Winskowski, 1983 | Gaschrom Q; Column length: 2. m |
Packed | SE-30 | 150. | 356. | Haken, Nguyen, et al., 1979 | Celatom AW silanized; Column length: 3.7 m |
Packed | Apiezon L | 120. | 336. | Bogoslovsky, Anvaer, et al., 1978 | Celite 545 |
Packed | SE-30 | 100. | 373. | Pías and Gascó, 1975 | Ar, Chromosorb W AW DMCS HP (80-100 mesh); Column length: 1. m |
Packed | Apiezon L | 100. | 355. | Brown, Chapman, et al., 1968 | N2, DCMS-treated Chromosorb W; Column length: 2.3 m |
Packed | SE-30 | 80. | 330. | Viani, Müggler-Chavan, et al., 1965 | He, Chromosorb P; Column length: 6. m |

Kovats' RI, non-polar column, custom temperature program

Column type | Active phase | I | Reference | Comment |
---|---|---|---|---|
Capillary | Petrocol DH-100 | 380. | Haagen-Smit Laboratory, 1997 | He; Column length: 100. m; Column diameter: 0.2 mm; Program: 5C(10min) => 5C/min => 50C(48min) => 1.5C/min => 195C(91min) |

Kovats' RI, polar column, isothermal

Column type | Active phase | Temperature (C) | I | Reference | Comment |
---|---|---|---|---|---|
Capillary | OV-351 | 100. | 917. | Haken and Korhonen, 1985 | N2; Column length: 25. m; Column diameter: 0.32 mm |
Capillary | OV-351 | 80. | 891. | Haken and Korhonen, 1985 | N2; Column length: 25. m; Column diameter: 0.32 mm |
Packed | PEG-2000 | 152. | 860. | Anderson, Jurel, et al., 1973 | He, Celite 545 (44-60 mesh); Column length: 3. m |
Packed | PEG-2000 | 179. | 881. | Anderson, Jurel, et al., 1973 | He, Celite 545 (44-60 mesh); Column length: 3. m |
Packed | Carbowax 20M | 100. | 892. | Zarazir, Chovin, et al., 1970 | Chromosorb W; Column length: 2. m |
Packed | Polyethylene Glycol 4000 | 100. | 904. | Bonastre and Grenier, 1968 | Chromosorb P; Column length: 6. m |
Packed | Polyethylene Glycol 4000 | 120. | 897. | Bonastre and Grenier, 1968 | Chromosorb P; Column length: 6. m |
Packed | Polyethylene Glycol 4000 | 140. | 886. | Bonastre and Grenier, 1968 | Chromosorb P; Column length: 6. m |
Packed | Polyethylene Glycol 4000 | 80. | 914. | Bonastre and Grenier, 1968 | Chromosorb P; Column length: 6. m |

Kovats' RI, polar column, temperature ramp

Column type | Active phase | I | Reference | Comment |
---|---|---|---|---|
Capillary | CBP-20 | 899. | Shimadzu, 2003 | 25. m/0.2 mm/0.25 μm, He, 50. C @ 5. min, 4. K/min; Tend: 200. C |
Capillary | DB-Wax | 888. | Shimoda and Shibamoto, 1990 | He, 40. C @ 6. min, 3. K/min; Column length: 60. m; Column diameter: 0.25 mm; Tend: 190. C |

Kovats' RI, polar column, custom temperature program

Column type | Active phase | I | Reference | Comment |
---|---|---|---|---|
Packed | Carbowax 20M | 869. | Kevei and Kozma, 1976 | Chromosorb; Program: not specified |

Van Den Dool and Kratz RI, non-polar column, temperature ramp

Column type | Active phase | I | Reference | Comment |
---|---|---|---|---|
Capillary | Petrocol DH | 372.7 | Censullo, Jones, et al., 2003 | 50. m/0.25 mm/0.5 μm, He, 35. C @ 10. min, 3. K/min, 200. C @ 10. min |
Capillary | Petrocol DH | 378.2 | Censullo, Jones, et al., 2003 | 50. m/0.25 mm/0.5 μm, He, 35. C @ 10. min, 3. K/min, 200. C @ 10. min |
Capillary | SE-30 | 400.0 | Golovnya, Kuz'menko, et al., 2000 | 25. m/0.32 mm/1. μm, He, 4. K/min; Tstart: 60. C |
Capillary | SE-30 | 400.0 | Golovnya, Kuz'menko, et al., 2000, 2 | 25. m/0.32 mm/1. μm, He, 4. K/min; Tstart: 60. C |
Capillary | DB-1 | 361. | Bartelt, 1997 | 30. m/0.32 mm/5. μm, He, 35. C @ 1. min, 10. K/min; Tend: 270. C |

Van Den Dool and Kratz RI, non-polar column, custom temperature program

Column type | Active phase | I | Reference | Comment |
---|---|---|---|---|
Packed | SE-30 | 368. | Peng, Ding, et al., 1988 | Supelcoport; Chromosorb; Column length: 3.05 m; Program: 40C(5min) => 10C/min => 200C or 250C (60min) |

Van Den Dool and Kratz RI, polar column, temperature ramp

Column type | Active phase | I | Reference | Comment |
---|---|---|---|---|
Capillary | Carbowax | 910.4 | Censullo, Jones, et al., 2003 | 60. m/0.25 mm/0.5 μm, He, 50. C @ 10. min, 5. K/min, 250. C @ 10. min |
Capillary | FFAP | 916. | Ott, Fay, et al., 1997 | 30. m/0.25 mm/0.25 μm, He, 20. C @ 1. min, 4. K/min, 200. C @ 1. min |
Packed | Carbowax 20M | 866. | van den Dool and Kratz, 1963 | Celite 545, 4.6 K/min; Tstart: 75. C; Tend: 228. C |

Normal alkane RI, non-polar column, isothermal

Column type | Active phase | Temperature (C) | I | Reference | Comment |
---|---|---|---|---|---|
Capillary | DB-1 | 60. | 382. | Shimadzu, 2003, 2 | 60. m/0.32 mm/1. μm, He |
Packed | Squalane | 100. | 338. | Vernon, 1971 | N2 |
Packed | DC-400 | 150. | 370. | Anderson, 1968 | Helium, Gas-Pak (60-80 mesh); Column length: 3.0 m |
Packed | Squalane | 125. | 348. | Cremer and Nonn, 1964 | H2, Chromosorb W (80-100 mesh); Column length: 3. m |

Normal alkane RI, non-polar column, temperature ramp

Column type | Active phase | I | Reference | Comment |
---|---|---|---|---|
Capillary | Polydimethyl siloxane: CP-Sil 5 CB | 395. | Bramston-Cook, 2013 | 60. m/0.25 mm/1.0 μm, Helium, 45. C @ 1.45 min, 3.6 K/min, 210. C @ 2.72 min |
Capillary | Petrocol DH | 379. | Supelco, 2012 | 100. m/0.25 mm/0.50 μm, Helium, 20. C @ 15. min, 15. K/min, 220. C @ 30. min |
Capillary | HP-5 | 367.5 | Leffingwell and Alford, 2005 | 60. m/0.32 mm/0.25 μm, He, 30. C @ 2. min, 2. K/min, 260. C @ 28. min |
Capillary | OV-101 | 381. | Zenkevich, 2005 | 25. m/0.20 mm/0.10 μm, N2/He, 6. K/min; Tstart: 50. C; Tend: 250. C |
Capillary | BP-1 | 370. | Health Safety Executive, 2000 | 50. m/0.22 mm/0.75 μm, He, 5. K/min; Tstart: 50. C; Tend: 200. C |
Capillary | DB-5MS | 353.5 | Shoenmakers, Oomen, et al., 2000 | 30. m/0.25 mm/0.25 μm, He, 40. C @ 1. min, 3. K/min; Tend: 250. C |

Normal alkane RI, non-polar column, custom temperature program

Column type | Active phase | I | Reference | Comment |
---|---|---|---|---|
Capillary | HP-5 MS | 381. | Kotowska, Zalikowski, et al., 2012 | 30. m/0.25 mm/0.25 μm, Helium; Program: not specified |
Capillary | Methyl Silicone | 373. | Chen and Feng, 2007 | Program: not specified |
Capillary | Methyl Silicone | 373. | Kou, Zhang, et al., 2006 | Program: not specified |
Capillary | Methyl Silicone | 408. | Blunden, Aneja, et al., 2005 | 60. m/0.32 mm/1.0 μm, Helium; Program: -50 0C (2 min) 8 0C/min -> 200 0C (7.75 min) 25 0C -> 225 0C (8 min) |
Capillary | Methyl Silicone | 373. | Fu and Wang, 2004 | Program: not specified |
Capillary | Methyl Silicone | 362. | N/A | Program: not specified |
Capillary | Polydimethyl siloxanes | 381. | Zenkevich, 2001 | Program: not specified |
Capillary | Polydimethyl siloxanes | 381. | Zenkevich, 2001, 2 | Program: not specified |
Capillary | Methyl Silicone | 381. | Zenkevich, 1999 | Program: not specified |
Capillary | SPB-1 | 353. | Flanagan, Streete, et al., 1997 | 60. m/0.53 mm/5. μm, He; Program: 40C(6min) => 5C/min => 80C => 10C/min => 200C |
Capillary | Polydimethyl siloxanes | 381. | Zenkevich and Chupalov, 1996 | Program: not specified |
Capillary | Methyl Silicone | 381. | Zenkevich, Korolenko, et al., 1995 | Program: not specified |
Capillary | DB-1 | 348. | Schuberth, 1994 | 30. m/0.25 mm/1. μm, He; Program: 40C (4min) => 10C/min => 200C => 50C/min => 250C |
Capillary | SPB-1 | 353. | Strete, Ruprah, et al., 1992 | 60. m/0.53 mm/5.0 μm, Helium; Program: 40 0C (6 min) 5 0C/min -> 80 0C 10 0C/min -> 200 0C |
Capillary | SPB-1 | 391. | Strete, Ruprah, et al., 1992 | 60. m/0.53 mm/5.0 μm, Helium; Program: not specified |
Capillary | CP Sil 8 CB | 404. | Weller and Wolf, 1989 | 40. m/0.25 mm/0.25 μm, He; Program: 30 0C (1 min) 15 0C/min -> 45 0C 3 0C/min -> 120 0C |
Capillary | OV-1, SE-30, Methyl silicone, SP-2100, OV-101, DB-1, etc. | 384. | Waggott and Davies, 1984 | Hydrogen; Column length: 50. m; Column diameter: 0.32 mm; Program: not specified |

Normal alkane RI, polar column, isothermal

Column type | Active phase | Temperature (C) | I | Reference | Comment |
---|---|---|---|---|---|
Capillary | Carbowax 20M | 100. | 892. | Sun, Siepmann, et al., 2006 | 30. m/0.25 mm/0.25 μm, Helium |
Capillary | Carbowax 20M | 60. | 899. | Sun, Siepmann, et al., 2006 | 30. m/0.25 mm/0.25 μm, Helium |
Capillary | Carbowax 20M | 80. | 895. | Sun, Siepmann, et al., 2006 | 30. m/0.25 mm/0.25 μm, Helium |
Capillary | DB-Wax | 60. | 921. | Shimadzu, 2003, 2 | 50. m/0.32 mm/1. μm, He |

Normal alkane RI, polar column, temperature ramp

Column type | Active phase | I | Reference | Comment |
---|---|---|---|---|
Capillary | DB-Wax | 911. | Shimadzu, 2012 | 30. m/0.32 mm/0.50 μm, Helium, 4. K/min; Tstart: 40. C; Tend: 260. C |
Capillary | DB-Wax | 907. | Chida, Sone, et al., 2004 | 60. m/0.25 mm/0.5 μm, 35. C @ 5. min, 4. K/min, 240. C @ 10. min |
Capillary | DB-Wax | 911. | Shimadzu Corporation, 2003 | 30. m/0.32 mm/0.5 μm, He, 4. K/min; Tstart: 40. C; Tend: 260. C |
Capillary | DB-Wax | 903. | Tanaka, Yamauchi, et al., 2003 | 30. m/0.25 mm/0.25 μm, 30. C @ 1. min, 4. K/min; Tend: 250. C |
Capillary | DB-Wax | 905. | Tanaka, Yamauchi, et al., 2003 | 30. m/0.25 mm/0.25 μm, 30. C @ 1. min, 4. K/min; Tend: 250. C |
Capillary | TC-Wax | 898. | Suhardi, Suzuki, et al., 2002 | 60. m/0.25 mm/0.25 μm, He, 40. C @ 10. min, 3. K/min, 230. C @ 10. min |
Capillary | DB-Wax | 905. | Duque, Bonilla, et al., 2001 | 30. m/0.25 mm/0.25 μm, Helium, 4. K/min, 220. C @ 30. min; Tstart: 25. C |

Normal alkane RI, polar column, custom temperature program

Column type | Active phase | I | Reference | Comment |
---|---|---|---|---|
Capillary | Carbowax 20M | 920. | Vinogradov, 2004 | Program: not specified |
Capillary | Polyethylene Glycol | 897. | Zenkevich, Korolenko, et al., 1995 | Program: not specified |
Capillary | DB-Wax | 909. | Peng, Yang, et al., 1991 | Program: not specified |
Capillary | Carbowax 400, Carbowax 20M, Carbowax 1540, Carbowax 4000, Superox 06, PEG 20M, etc. | 907. | Waggott and Davies, 1984 | Hydrogen; Column length: 50. m; Column diameter: 0.32 mm; Program: not specified |
Capillary | Carbowax 400, Carbowax 20M, Carbowax 1540, Carbowax 4000, Superox 06, PEG 20M, etc. | 920. | Waggott and Davies, 1984 | Hydrogen; Column length: 50. m; Column diameter: 0.32 mm; Program: not specified |
Capillary | Carbowax 20M | 883. | Ramsey and Flanagan, 1982 | Program: not specified |

Vibrational and/or electronic energy levels

Data compiled by: Takehiko Shimanouchi
Gas Symmetry: Cs Symmetry Number σ = 1
Sym. | No | Approximate | Selected Freq. | Infrared | Raman | Comments | ||||
---|---|---|---|---|---|---|---|---|---|---|
Species | type of mode | Value | Rating | Value | Phase | Value | Phase | |||
a' | 1 | OH str | 3681 | A | 3681 M | gas | ||||
a' | 2 | CH3 d-str | 3000 | C | 3000 M | gas | ||||
a' | 3 | CH3 s-str | 2844 | A | 2844 S | gas | ||||
a' | 4 | CH3 d-deform | 1477 | B | 1477 M | gas | OV(ν10) | |||
a' | 5 | CH3 s-deform | 1455 | A | 1455 M | gas | ||||
a' | 6 | OH bend | 1345 | B | 1345 S | gas | ||||
a' | 7 | CH3 rock | 1060 | D | 1060 W | gas | OV(ν8) | |||
a' | 8 | CO str | 1033 | A | 1033 VS | gas | 1032 | gas | ||
a | 9 | CH3 d-str | 2960 | C | 2960 S | gas | 2955 | gas | ||
a | 10 | CH3 d-deform | 1477 | B | 1477 M | gas | OV(ν4) | |||
a | 11 | CH3 rock | 1165 | C | 1165 | liq. | ||||
a | 12 | Torsion | 295 | A | 80~300 | gas | ?/? Value of ν12 is undefined because of large coupling between internal & overall rotations. | |||
a | 12 | Torsion | 200 | E | 80~300 | gas | ?/? Value of ν12 is undefined because of large coupling between internal & overall rotations. | |||
Source: Shimanouchi, 1972
Liquid Symmetry: Cs Symmetry Number σ = 1
Sym. | No | Approximate | Selected Freq. | Infrared | Raman | Comments | ||||
---|---|---|---|---|---|---|---|---|---|---|
Species | type of mode | Value | Rating | Value | Phase | Value | Phase | |||
a' | 1 | OH str | 3328 | D | 3328 vb | liq. | 3270-3480 | liq. | ||
a' | 2 | CH3 d-str | 2980 | C | 2980 M | liq. | 2993 | liq. | ||
a' | 3 | CH3 s-str | 2834 | C | 2834 S | liq. | 2834 | liq. | ||
a' | 4 | CH3 d-deform | 1480 | C | 1480 M | liq. | 1464 | liq. | OV(ν10) | |
a' | 5 | CH3 s-deform | 1450 | C | 1450 M | liq. | ||||
a' | 6 | OH bend | 1418 | C | 1418 M b | liq. | ||||
a' | 7 | CH3 rock | 1115 | C | 1115 M | liq. | 1107 | liq. | ||
a' | 8 | CO str | 1030 | C | 1030 VS | liq. | 1033 | liq. | ||
a | 9 | CH3 d-str | 2946 | C | 2946 S | liq. | 2940 | liq. | ||
a | 10 | CH3 d-deform | 1480 | C | 1480 M | liq. | 1464 | liq. | OV(ν4) | |
a | 11 | CH3 rock | 1165 | C | 1165 | liq. | ||||
a | 12 | Torsion | 655 | D | 655 vb | liq. | ||||
Source: Shimanouchi, 1972

Condensed phase thermochemistry data

Data compiled as indicated in comments:
ALS - Hussein Y. Afeefy, Joel F. Liebman, and Stephen E. Stein
DRB - Donald R. Burgess, Jr.
DH - Eugene S. Domalski and Elizabeth D. Hearing

Quantity Value Units Method Reference Comment
Δfliquid-238.4kJ/molCcrBaroody and Carpenter, 1972ALS
Δfliquid-239.5 ± 0.2kJ/molCcbChao and Rossini, 1965see Rossini, 1934; ALS
Δfliquid-238.9 ± 3.6kJ/molCcbGreen, 1960Reanalyzed by Cox and Pilcher, 1970, Original value = -238.5 ± 0.2 kJ/mol; ALS
Δfliquid-250.6kJ/molCcbParks, 1925ALS
Δfliquid-251.3 ± 5.0kJ/molCcbRichards and Davis, 1920DRB
Quantity Value Units Method Reference Comment
Δcliquid-725.7 ± 0.1kJ/molCcbChao and Rossini, 1965see Rossini, 1934; Corresponding Δfliquid = -239.5 kJ/mol (simple calculation by NIST; no Washburn corrections); ALS
Δcliquid-726.5 ± 0.2kJ/molCcbGreen, 1960Corresponding Δfliquid = -238.7 kJ/mol (simple calculation by NIST; no Washburn corrections); ALS
Δcliquid-726.34 ± 0.20kJ/molCcbRossini, 1931Corresponding Δfliquid = -238.83 kJ/mol (simple calculation by NIST; no Washburn corrections); ALS
Δcliquid-715.05kJ/molCcbParks, 1925Corresponding Δfliquid = -250.1 kJ/mol (simple calculation by NIST; no Washburn corrections); ALS
Δcliquid-713.83kJ/molCcbRichards and Davis, 1920At 291 K; Corresponding Δfliquid = -251.34 kJ/mol (simple calculation by NIST; no Washburn corrections); ALS
Quantity Value Units Method Reference Comment
liquid127.19J/mol*KN/ACarlson and Westrum, 1971DH
liquid126.8J/mol*KN/AKelley, 1929DH
liquid129.7J/mol*KN/AParks, Kelley, et al., 1929Extrapolation below 90 K, 34.3 J/mol*K. Revision of previous data.; DH
liquid136.4J/mol*KN/AParks, 1925Extrapolation below 90 K, 40.75 J/mol*K.; DH
Quantity Value Units Method Reference Comment
solid,1 bar1.117J/mol*KN/AAhlberg, Blanchard, et al., 1937DH

Constant pressure heat capacity of liquid

Cp,liquid (J/mol*K) Temperature (K) Reference Comment
79.5298.15Filatov and Afanas'ev, 1992DH
81.11298.15Khasanshin and Zykova, 1989T = 175 to 338 K. Unsmoothed experimental datum.; DH
80.24298.15Andreoli-Ball, Patterson, et al., 1988DH
80.35298.15Okano, Ogawa, et al., 1988DH
81.0298.15Lankford and Criss, 1987DH
81.32298.Korolev, Kukharenko, et al., 1986DH
80.28298.15Ogawa and Murakami, 1986DH
81.56298.15Tanaka, Toyama, et al., 1986DH
80.22298.15Costas and Patterson, 1985T = 298.15, 313.15 K.; DH
81.47298.15Zegers and Somsen, 1984DH
78.90288.15Benson and D'Arcy, 1982DH
81.92298.15Villamanan, Casanova, et al., 1982DH
80.8293.15Atalla, El-Sharkawy, et al., 1981DH
81.13298.15Carlson and Westrum, 1971T = 5 to 332 K.; DH
83.7298.Deshpande and Bhatagadde, 1971T = 298 to 318 K.; DH
85.8313.2Paz Andrade, Paz, et al., 1970DH
85.8298.2Katayama, 1962T = 10 to 60°C.; DH
80.8311.Swietoslawski and Zielenkiewicz, 1960Mean value 21 to 56°C.; DH
86.2323.Hough, Mason, et al., 1950T = 323 to 353 K.; DH
75.77270.Staveley and Gupta, 1949T = 90 to 270 K.; DH
86.6300.8Phillip, 1939DH
83.56313.15Fiock, Ginnings, et al., 1931T = 40 to 110°C.; DH
79.9292.0Kelley, 1929T = 16 to 293 K. Value is unsmoothed experimental datum.; DH
78.2270.Mitsukuri and Hara, 1929T = 190 to 270 K.; DH
79.9290.1Parks, 1925T = 89 to 290 K. Value is unsmoothed experimental datum.; DH
83.3298.von Reis, 1881T = 288 to 335 K.; DH

Constant pressure heat capacity of solid

Cp,solid (J/mol*K) Temperature (K) Reference Comment
68.39120.Sugisaki, Suga, et al., 1968glass phase; T = 20 to 120 K.; DH
5.4020.5Ahlberg, Blanchard, et al., 1937T = 5 to 28 K.; DH
105.173.Maass and Walbauer, 1925T = 93 to 173 K.; DH

Phase change data

Data compiled as indicated in comments:
TRC - Thermodynamics Research Center, NIST Boulder Laboratories, Chris Muzny director
DH - Eugene S. Domalski and Elizabeth D. Hearing
AC - William E. Acree, Jr., James S. Chickos
ALS - Hussein Y. Afeefy, Joel F. Liebman, and Stephen E. Stein
DRB - Donald R. Burgess, Jr.
CAL - James S. Chickos, William E. Acree, Jr., Joel F. Liebman, Students of Chem 202 (Introduction to the Literature of Chemistry), University of Missouri -- St. Louis

Quantity Value Units Method Reference Comment
Tboil337.8 ± 0.3KAVGN/AAverage of 154 out of 171 values; Individual data points
Quantity Value Units Method Reference Comment
Tfus176. ± 1.KAVGN/AAverage of 13 values; Individual data points
Quantity Value Units Method Reference Comment
Ttriple175.5 ± 0.5KAVGN/AAverage of 8 values; Individual data points
Quantity Value Units Method Reference Comment
Tc513. ± 1.KAVGN/AAverage of 27 out of 31 values; Individual data points
Quantity Value Units Method Reference Comment
Pc81. ± 1.barAVGN/AAverage of 17 out of 20 values; Individual data points
Quantity Value Units Method Reference Comment
Vc0.117l/molN/AGude and Teja, 1995
Vc0.113024l/molN/ACraven and de Reuck, 1986TRC
Vc0.118l/molN/AFrancesconi, Lentz, et al., 1981Uncertainty assigned by TRC = 0.004 l/mol; TRC
Vc0.11663l/molN/AZubarev and Bagdonas, 1969Uncertainty assigned by TRC = 0.0035 l/mol; TRC
Quantity Value Units Method Reference Comment
ρc8.51 ± 0.07mol/lAVGN/AAverage of 7 values; Individual data points
Quantity Value Units Method Reference Comment
Δvap37.6 ± 0.5kJ/molAVGN/AAverage of 11 out of 12 values; Individual data points

Enthalpy of vaporization

ΔvapH (kJ/mol) Temperature (K) Method Reference Comment
35.21337.7N/AMajer and Svoboda, 1985
39.2258.AStephenson and Malanowski, 1987Based on data from 175. - 273. K.; AC
36.9353.AStephenson and Malanowski, 1987Based on data from 338. - 487. K.; AC
43.7213.AStephenson and Malanowski, 1987Based on data from 188. - 228. K.; AC
38.9275.AStephenson and Malanowski, 1987Based on data from 224. - 290. K.; AC
38.3300.AStephenson and Malanowski, 1987Based on data from 285. - 345. K.; AC
37.0350.AStephenson and Malanowski, 1987Based on data from 335. - 376. K.; AC
36.1388.AStephenson and Malanowski, 1987Based on data from 373. - 458. K.; AC
35.1468.AStephenson and Malanowski, 1987Based on data from 453. - 513. K.; AC
32.7373.CYerlett and Wormald, 1986AC
28.1423.CYerlett and Wormald, 1986AC
20.6473.CYerlett and Wormald, 1986AC
7.4510.CYerlett and Wormald, 1986AC
37.5331.EBCervenkova and Boublik, 1984Based on data from 316. - 336. K.; AC
38.3303.N/AGibbard and Creek, 1974Based on data from 288. - 337. K. See also Boublik, Fried, et al., 1984.; AC
35.2 ± 0.1338.CCounsell and Lee, 1973AC
35.6 ± 0.1331.CCounsell and Lee, 1973AC
36.2 ± 0.1321.CCounsell and Lee, 1973AC
37.0 ± 0.1306.CCounsell and Lee, 1973AC
36.7 ± 0.1313.CSvoboda, Veselý, et al., 1973AC
36.2 ± 0.1323.CSvoboda, Veselý, et al., 1973AC
35.6 ± 0.1333.CSvoboda, Veselý, et al., 1973AC
35.3 ± 0.1338.CSvoboda, Veselý, et al., 1973AC
34.7 ± 0.1343.CSvoboda, Veselý, et al., 1973AC
37.0352.N/AWilhoit and Zwolinski, 1973Based on data from 337. - 383. K.; AC
38.7290.EBBoublík and Aim, 1972Based on data from 275. - 336. K. See also Stephenson and Malanowski, 1987.; AC
38.3303.EBAmbrose and Sprake, 1970Based on data from 288. - 357. K.; AC
36.3368.N/AHirata, Suda, et al., 1967Based on data from 353. - 483. K.; AC
38.4293.N/AKlyueva, Mischenko, et al., 1960Based on data from 278. - 323. K.; AC

Enthalpy of vaporization

ΔvapH = A exp(-αTr) (1 − Tr)β
    ΔvapH = Enthalpy of vaporization (at saturation pressure) (kJ/mol)
    Tr = reduced temperature (T / Tc)

View plot Requires a JavaScript / HTML 5 canvas capable browser.

Temperature (K) 298. - 477.
A (kJ/mol) 45.3
α -0.31
β 0.4241
Tc (K) 512.6
ReferenceMajer and Svoboda, 1985

Antoine Equation Parameters

log10(P) = A − (B / (T + C))
    P = vapor pressure (bar)
    T = temperature (K)

View plot Requires a JavaScript / HTML 5 canvas capable browser.

Temperature (K) A B C Reference Comment
353.5 - 512.635.158531569.613-34.846Ambrose, Sprake, et al., 1975Coefficents calculated by NIST from author's data.
288.1 - 356.835.204091581.341-33.50Ambrose and Sprake, 1970Coefficents calculated by NIST from author's data.
353. - 483.5.313011676.569-21.728Hirata and Suda, 1967Coefficents calculated by NIST from author's data.

Enthalpy of fusion

ΔfusH (kJ/mol) Temperature (K) Reference Comment
3.18175.3Domalski and Hearing, 1996AC
2.196176.Maass and Walbauer, 1925DH

Entropy of fusion

ΔfusS (J/mol*K) Temperature (K) Reference Comment
12.5176.Maass and Walbauer, 1925DH

Entropy of fusion

ΔfusS (J/mol*K) Temperature (K) Reference Comment
3.7161.1Domalski and Hearing, 1996CAL
18.1175.3
4.0157.3
18.3175.6

Enthalpy of phase transition

ΔHtrs (kJ/mol) Temperature (K) Initial Phase Final Phase Reference Comment
0.6360157.34crystaline, IIcrystaline, ICarlson and Westrum, 1971DH
3.2154175.59crystaline, IliquidCarlson and Westrum, 1971DH
1.540103.crystalineglassSugisaki, Suga, et al., 1968Glass transition.; DH
0.711157.8crystaline, IIcrystaline, IStaveley and Gupta, 1949DH
3.159175.4crystaline, IliquidStaveley and Gupta, 1949DH
0.6456157.4crystaline, IIcrystaline, IKelley, 1929DH
3.167175.2crystaline, IliquidKelley, 1929DH
0.590161.1crystaline, IIcrystaline, IParks, 1925DH
3.176175.3crystaline, IliquidParks, 1925DH

Entropy of phase transition

ΔStrs (J/mol*K) Temperature (K) Initial Phase Final Phase Reference Comment
4.04157.34crystaline, IIcrystaline, ICarlson and Westrum, 1971DH
18.31175.59crystaline, IliquidCarlson and Westrum, 1971DH
14.95103.crystalineglassSugisaki, Suga, et al., 1968Glass; DH
4.51157.8crystaline, IIcrystaline, IStaveley and Gupta, 1949DH
18.01175.4crystaline, IliquidStaveley and Gupta, 1949DH
4.10157.4crystaline, IIcrystaline, IKelley, 1929DH
18.08175.2crystaline, IliquidKelley, 1929DH
3.66161.1crystaline, IIcrystaline, IParks, 1925DH
18.12175.3crystaline, IliquidParks, 1925DH

In addition to the Thermodynamics Research Center (TRC) data available from this site, much more physical and chemical property data is available from the following TRC products:

Reaction thermochemistry data

Data compiled as indicated in comments:
B - John E. Bartmess
M - Michael M. Meot-Ner (Mautner) and Sharon G. Lias
RCD - Robert C. Dunbar
ALS - Hussein Y. Afeefy, Joel F. Liebman, and Stephen E. Stein

Reactions 1 to 50

Chlorine anion + Methyl Alcohol = (Chlorine anion • Methyl Alcohol)

By formula: Cl- + CH4O = (Cl- • CH4O)

Quantity Value Units Method Reference Comment
Δr69. ± 10.kJ/molAVGN/AAverage of 8 values; Individual data points
Quantity Value Units Method Reference Comment
Δr94.6J/mol*KHPMSEvans and Keesee, 1991gas phase; M
Δr101.J/mol*KPHPMSHiraoka and Mizuse, 1987gas phase; M
Δr92.0J/mol*KPHPMSSieck, 1985gas phase; M
Δr95.8J/mol*KN/ALarson and McMahon, 1984gas phase; switching reaction(Cl-)t-C4H9OH, Entropy change calculated or estimated; French, Ikuta, et al., 1982; M
Δr61.9J/mol*KPHPMSYamdagni, Payzant, et al., 1973gas phase; Entropy change is questionable; M
Quantity Value Units Method Reference Comment
Δr42. ± 3.kJ/molAVGN/AAverage of 10 values; Individual data points

CH3O- + Hydrogen cation = Methyl Alcohol

By formula: CH3O- + H+ = CH4O

Quantity Value Units Method Reference Comment
Δr1597. ± 8.kJ/molAVGN/AAverage of 6 values; Individual data points
Quantity Value Units Method Reference Comment
Δr1573.3 ± 2.6kJ/molH-TSNee, Osterwalder, et al., 2006gas phase; B
Δr1573.4 ± 2.3kJ/molH-TSOsborn, Leahy, et al., 1998gas phase; B
Δr1565. ± 8.4kJ/molIMREBartmess, Scott, et al., 1979gas phase; The acidity is 1.2 kcal/mol stronger than that from the D-EA cycle, due to the multi-compound fit for the acidity scale.; value altered from reference due to change in acidity scale; B
Δr1567. ± 8.8kJ/molH-TSHaas and Harrison, 1993gas phase; Both metastable and 50 eV collision energy.; B
Δr1569.4 ± 2.5kJ/molTDEqMeot-ner and Sieck, 1986gas phase; Experimental entropy: 21.5 eu, 0.6 less than H2O; B

CH5O+ + Methyl Alcohol = (CH5O+ • Methyl Alcohol)

By formula: CH5O+ + CH4O = (CH5O+ • CH4O)

Bond type: Hydrogen bonds of the type OH-O between organics

Quantity Value Units Method Reference Comment
Δr136.kJ/molPHPMSMeot-Ner (Mautner), 1992gas phase; M
Δr135.kJ/molPHPMSSzulejko and McMahon, 1992gas phase; M
Δr134.kJ/molPHPMSMeot-Ner(Mautner), 1986gas phase; M
Δr138.kJ/molPHPMSGrimsrud and Kebarle, 1973gas phase; M
Δr141.kJ/molICRLarson and McMahon, 1982gas phase; switching reaction((CH3)2OH+)(CH3)2O; Entropy change calculated or estimated; Grimsrud and Kebarle, 1973, Lias, Liebman, et al., 1984, Keesee and Castleman, 1986; M
Quantity Value Units Method Reference Comment
Δr121.J/mol*KPHPMSMeot-Ner (Mautner), 1992gas phase; M
Δr122.J/mol*KPHPMSSzulejko and McMahon, 1992gas phase; M
Δr111.J/mol*KPHPMSMeot-Ner(Mautner), 1986gas phase; M
Δr128.J/mol*KPHPMSGrimsrud and Kebarle, 1973gas phase; M
Δr119.J/mol*KN/ALarson and McMahon, 1982gas phase; switching reaction((CH3)2OH+)(CH3)2O; Entropy change calculated or estimated; Grimsrud and Kebarle, 1973, Lias, Liebman, et al., 1984, Keesee and Castleman, 1986; M
Quantity Value Units Method Reference Comment
Δr105.kJ/molICRLarson and McMahon, 1982gas phase; switching reaction((CH3)2OH+)(CH3)2O; Entropy change calculated or estimated; Grimsrud and Kebarle, 1973, Lias, Liebman, et al., 1984, Keesee and Castleman, 1986; M

CH3O- + Methyl Alcohol = (CH3O- • Methyl Alcohol)

By formula: CH3O- + CH4O = (CH3O- • CH4O)

Quantity Value Units Method Reference Comment
Δr123. ± 4.2kJ/molTDAsPaul and Kebarle, 1990gas phase; B,M
Δr120.5 ± 1.3kJ/molTDAsMeot-ner and Sieck, 1986gas phase; B,M
Δr123. ± 10.kJ/molTDAsCaldwell, Rozeboom, et al., 1984gas phase; Reanchored to average data from Paul and Kebarle, 1990 and Meot-ner and Sieck, 1986.; value altered from reference due to change in acidity scale; B
Δr79.5 ± 8.4kJ/molN/AMoylan, Dodd, et al., 1985gas phase; B
Quantity Value Units Method Reference Comment
Δr133.J/mol*KPHPMSPaul and Kebarle, 1990gas phase; M
Δr112.J/mol*KPHPMSMeot-Ner(Mautner), 1986gas phase; n; M
Quantity Value Units Method Reference Comment
Δr84.94kJ/molIMREMustanir, Matsuoka, et al., 2006gas phase; B
Δr82.8 ± 4.2kJ/molTDAsPaul and Kebarle, 1990gas phase; B
Δr87.0 ± 2.1kJ/molTDAsMeot-ner and Sieck, 1986gas phase; B
Δr84.9 ± 6.7kJ/molTDAsCaldwell, Rozeboom, et al., 1984gas phase; Reanchored to average data from Paul and Kebarle, 1990 and Meot-ner and Sieck, 1986.; value altered from reference due to change in acidity scale; B

Free energy of reaction

ΔrG° (kJ/mol) T (K) Method Reference Comment
79.9296.FAMacKay and Bohme, 1978gas phase; From thermochemical cycle,switching reaction(CH3O-)H2O; Meot-Ner(Mautner), 1986; M

C4H9O- + Methyl Alcohol = (C4H9O- • Methyl Alcohol)

By formula: C4H9O- + CH4O = (C4H9O- • CH4O)

Quantity Value Units Method Reference Comment
Δr107. ± 4.2kJ/molTDEqMeot-Ner and Sieck, 1986gas phase; B,M
Δr97.9 ± 9.2kJ/molCIDTDeTuri and Ervin, 1999gas phase; B
Δr109. ± 10.kJ/molN/ACaldwell, Rozeboom, et al., 1984gas phase; Reanchored to average data from Paul and Kebarle, 1990 and Meot-ner and Sieck, 1986.; B,M
Quantity Value Units Method Reference Comment
Δr117.J/mol*KN/AMeot-Ner and Sieck, 1986gas phase; Entropy change calculated or estimated; M
Δr123.J/mol*KN/ACaldwell, Rozeboom, et al., 1984gas phase; switching reaction(CH3O-)CH3OH, Entropy change calculated or estimated; re-evaluated using Meot-Ner(Mautner), 1986 and Paul and Kebarle, 1990; M
Quantity Value Units Method Reference Comment
Δr42.68kJ/molIMREMustanir, Matsuoka, et al., 2006gas phase; B
Δr71.5 ± 6.7kJ/molTDEqMeot-Ner and Sieck, 1986gas phase; B
Δr72.4 ± 6.7kJ/molIMRECaldwell, Rozeboom, et al., 1984gas phase; Reanchored to average data from Paul and Kebarle, 1990 and Meot-ner and Sieck, 1986.; B,M

C2H5O- + Methyl Alcohol = (C2H5O- • Methyl Alcohol)

By formula: C2H5O- + CH4O = (C2H5O- • CH4O)

Quantity Value Units Method Reference Comment
Δr114. ± 12.kJ/molIMRECaldwell, Rozeboom, et al., 1984gas phase; Reanchored to average data from Paul and Kebarle, 1990 and Meot-ner and Sieck, 1986.; value altered from reference due to change in acidity scale; B,M
Δr107. ± 7.9kJ/molCIDTDeTuri and Ervin, 1999gas phase; B
Quantity Value Units Method Reference Comment
Δr123.J/mol*KN/ACaldwell, Rozeboom, et al., 1984gas phase; switching reaction(CH3O-)CH3OH, Entropy change calculated or estimated; re-evaluated using Meot-Ner(Mautner), 1986 and Paul and Kebarle, 1990; M
Quantity Value Units Method Reference Comment
Δr77.8 ± 8.4kJ/molIMRECaldwell, Rozeboom, et al., 1984gas phase; Reanchored to average data from Paul and Kebarle, 1990 and Meot-ner and Sieck, 1986.; value altered from reference due to change in acidity scale; B,M

Free energy of reaction

ΔrG° (kJ/mol) T (K) Method Reference Comment
56.1296.FAMackay, Rakshit, et al., 1982gas phase; From thermochemical cycle,switching reaction(CH3O-)CH3OH; Caldwell and Kebarle, 1986, Taft, 1983; M

(Chlorine anion • Methyl Alcohol) + Methyl Alcohol = (Chlorine anion • 2Methyl Alcohol)

By formula: (Cl- • CH4O) + CH4O = (Cl- • 2CH4O)

Quantity Value Units Method Reference Comment
Δr59.0 ± 1.7kJ/molTDAsBogdanov, Peschke, et al., 1999gas phase; B
Δr57.32 ± 0.84kJ/molTDAsEvans and Keesee, 1991gas phase; B,M
Δr59.0 ± 4.2kJ/molTDAsHiraoka and Mizuse, 1987gas phase; B,M
Δr54.4 ± 2.9kJ/molTDAsYamdagni, Payzant, et al., 1973gas phase; B,M
Quantity Value Units Method Reference Comment
Δr101.J/mol*KPHPMSHiraoka and Mizuse, 1987gas phase; M
Δr92.0J/mol*KHPMSEvans and Keesee, 1991gas phase; M
Δr81.2J/mol*KPHPMSYamdagni, Payzant, et al., 1973gas phase; M
Quantity Value Units Method Reference Comment
Δr30.5kJ/molTDAsBogdanov, Peschke, et al., 1999gas phase; B
Δr29.7kJ/molTDAsEvans and Keesee, 1991gas phase; B
Δr28. ± 4.2kJ/molTDAsHiraoka and Mizuse, 1987gas phase; B
Δr30.1 ± 1.7kJ/molTDAsYamdagni, Payzant, et al., 1973gas phase; B

(Chlorine anion • 2Methyl Alcohol) + Methyl Alcohol = (Chlorine anion • 3Methyl Alcohol)

By formula: (Cl- • 2CH4O) + CH4O = (Cl- • 3CH4O)

Quantity Value Units Method Reference Comment
Δr48.12 ± 0.84kJ/molTDAsBogdanov, Peschke, et al., 1999gas phase; B
Δr45.2 ± 1.3kJ/molTDAsEvans and Keesee, 1991gas phase; B,M
Δr49.4 ± 4.2kJ/molTDAsHiraoka and Mizuse, 1987gas phase; B,M
Δr51.5 ± 2.5kJ/molN/AYamdagni, Payzant, et al., 1973gas phase; B,M
Quantity Value Units Method Reference Comment
Δr95.8J/mol*KPHPMSHiraoka and Mizuse, 1987gas phase; M
Δr95.0J/mol*KHPMSEvans and Keesee, 1991gas phase; M
Δr98.7J/mol*KPHPMSYamdagni, Payzant, et al., 1973gas phase; M
Quantity Value Units Method Reference Comment
Δr21.2kJ/molTDAsBogdanov, Peschke, et al., 1999gas phase; B
Δr16.7kJ/molTDAsEvans and Keesee, 1991gas phase; B
Δr21. ± 4.2kJ/molTDAsHiraoka and Mizuse, 1987gas phase; B
Δr21.8 ± 1.3kJ/molTDAsYamdagni, Payzant, et al., 1973gas phase; B

C8H5- + Methyl Alcohol = (C8H5- • Methyl Alcohol)

By formula: C8H5- + CH4O = (C8H5- • CH4O)

Quantity Value Units Method Reference Comment
Δr90.0 ± 8.4kJ/molIMREChabinyc and Brauman, 1999gas phase; B
Δr90. ± 12.kJ/molN/ACaldwell, Rozeboom, et al., 1984gas phase; Reanchored to average data from Paul and Kebarle, 1990 and Meot-ner and Sieck, 1986.; value altered from reference due to change in acidity scale; B,M
Quantity Value Units Method Reference Comment
Δr123.J/mol*KN/ACaldwell, Rozeboom, et al., 1984gas phase; switching reaction(CH3O-)CH3OH, Entropy change calculated or estimated; re-evaluated using Meot-Ner(Mautner), 1986 and Paul and Kebarle, 1990; M
Quantity Value Units Method Reference Comment
Δr46.0 ± 8.4kJ/molIMREChabinyc and Brauman, 1999gas phase; B
Δr53.1 ± 8.4kJ/molIMRECaldwell, Rozeboom, et al., 1984gas phase; Reanchored to average data from Paul and Kebarle, 1990 and Meot-ner and Sieck, 1986.; value altered from reference due to change in acidity scale; B,M

CN- + Methyl Alcohol = (CN- • Methyl Alcohol)

By formula: CN- + CH4O = (CN- • CH4O)

Quantity Value Units Method Reference Comment
Δr65.7 ± 3.3kJ/molTDAsLarson, Szulejko, et al., 1988gas phase; B,M
Δr69.5 ± 4.2kJ/molTDAsMeot-ner, 1988gas phase; B
Δr69. ± 15.kJ/molIMRELarson and McMahon, 1987gas phase; B,M
Quantity Value Units Method Reference Comment
Δr96.J/mol*KPHPMSLarson, Szulejko, et al., 1988gas phase; M
Δr102.J/mol*KN/ALarson and McMahon, 1987gas phase; switching reaction,Thermochemical ladder(CN-)H2O, Entropy change calculated or estimated; Payzant, Yamdagni, et al., 1971; M
Quantity Value Units Method Reference Comment
Δr36.8 ± 0.84kJ/molTDAsLarson, Szulejko, et al., 1988gas phase; B
Δr43.5 ± 4.2kJ/molTDAsMeot-ner, 1988gas phase; B
Δr38. ± 9.6kJ/molIMRELarson and McMahon, 1987gas phase; B,M

Lithium ion (1+) + Methyl Alcohol = (Lithium ion (1+) • Methyl Alcohol)

By formula: Li+ + CH4O = (Li+ • CH4O)

Quantity Value Units Method Reference Comment
Δr154. ± 7.9kJ/molCIDTRodgers and Armentrout, 2000RCD
Δr159.kJ/molICRWoodin and Beauchamp, 1978gas phase; switching reaction(Li+)H20, Entropy change calculated or estimated; Dzidic and Kebarle, 1970 interpolated; M
Δr160.kJ/molICRStaley and Beauchamp, 1975gas phase; switching reaction(Li+)H2O, from graph; Dzidic and Kebarle, 1970 extrapolated; M
Quantity Value Units Method Reference Comment
Δr110.J/mol*KN/AWoodin and Beauchamp, 1978gas phase; switching reaction(Li+)H20, Entropy change calculated or estimated; Dzidic and Kebarle, 1970 interpolated; M
Quantity Value Units Method Reference Comment
Δr127.kJ/molICRWoodin and Beauchamp, 1978gas phase; switching reaction(Li+)H20, Entropy change calculated or estimated; Dzidic and Kebarle, 1970 interpolated; M

Iodide + Methyl Alcohol = (Iodide • Methyl Alcohol)

By formula: I- + CH4O = (I- • CH4O)

Quantity Value Units Method Reference Comment
Δr49.79 ± 0.84kJ/molTDAsBogdanov, Peschke, et al., 1999gas phase; B
Δr47.3 ± 4.2kJ/molTDAsCaldwell and Kebarle, 1984gas phase; B,M
Δr46.9kJ/molPHPMSHiraoka and Yamabe, 1991gas phase; M
Δr46.kJ/molPHPMSCaldwell, Masucci, et al., 1989gas phase; M
Quantity Value Units Method Reference Comment
Δr71.5J/mol*KPHPMSHiraoka and Yamabe, 1991gas phase; M
Δr74.5J/mol*KPHPMSCaldwell and Kebarle, 1984gas phase; M
Quantity Value Units Method Reference Comment
Δr24.1kJ/molTDAsBogdanov, Peschke, et al., 1999gas phase; B
Δr25. ± 4.2kJ/molTDAsCaldwell and Kebarle, 1984gas phase; B
Δr24. ± 8.4kJ/molIMRETanabe, Morgon, et al., 1996gas phase; Anchored to H2O..I- of Caldwell and Kebarle, 1984; B

C2H5O+ + Methyl Alcohol = (C2H5O+ • Methyl Alcohol)

By formula: C2H5O+ + CH4O = (C2H5O+ • CH4O)

Bond type: Hydrogen bonds of the type OH-O between organics

Quantity Value Units Method Reference Comment
Δr127.kJ/molICRLarson and McMahon, 1982gas phase; switching reaction((CH3)2OH+)(CH3)2O, Entropy change calculated or estimated; Grimsrud and Kebarle, 1973, Lias, Liebman, et al., 1984, Keesee and Castleman, 1986; M
Quantity Value Units Method Reference Comment
Δr113.J/mol*KN/ALarson and McMahon, 1982gas phase; switching reaction((CH3)2OH+)(CH3)2O, Entropy change calculated or estimated; Grimsrud and Kebarle, 1973, Lias, Liebman, et al., 1984, Keesee and Castleman, 1986; M
Quantity Value Units Method Reference Comment
Δr93.3kJ/molICRLarson and McMahon, 1982gas phase; switching reaction((CH3)2OH+)(CH3)2O, Entropy change calculated or estimated; Grimsrud and Kebarle, 1973, Lias, Liebman, et al., 1984, Keesee and Castleman, 1986; M

C2H7O+ + Methyl Alcohol = (C2H7O+ • Methyl Alcohol)

By formula: C2H7O+ + CH4O = (C2H7O+ • CH4O)

Bond type: Hydrogen bonds of the type OH-O between organics

Quantity Value Units Method Reference Comment
Δr124.kJ/molICRLarson and McMahon, 1982gas phase; switching reaction((CH3)2OH+)(CH3)2O, Entropy change calculated or estimated; Grimsrud and Kebarle, 1973, Lias, Liebman, et al., 1984, Keesee and Castleman, 1986; M
Quantity Value Units Method Reference Comment
Δr111.J/mol*KN/ALarson and McMahon, 1982gas phase; switching reaction((CH3)2OH+)(CH3)2O, Entropy change calculated or estimated; Grimsrud and Kebarle, 1973, Lias, Liebman, et al., 1984, Keesee and Castleman, 1986; M
Quantity Value Units Method Reference Comment
Δr90.8kJ/molICRLarson and McMahon, 1982gas phase; switching reaction((CH3)2OH+)(CH3)2O, Entropy change calculated or estimated; Grimsrud and Kebarle, 1973, Lias, Liebman, et al., 1984, Keesee and Castleman, 1986; M

C3H7O- + Methyl Alcohol = (C3H7O- • Methyl Alcohol)

By formula: C3H7O- + CH4O = (C3H7O- • CH4O)

Quantity Value Units Method Reference Comment
Δr113. ± 12.kJ/molN/ACaldwell, Rozeboom, et al., 1984gas phase; Reanchored to average data from Paul and Kebarle, 1990 and Meot-ner and Sieck, 1986.; value altered from reference due to change in acidity scale; B,M
Quantity Value Units Method Reference Comment
Δr123.J/mol*KN/ACaldwell, Rozeboom, et al., 1984gas phase; switching reaction(CH3O-)CH3OH, Entropy change calculated or estimated; re-evaluated using Meot-Ner(Mautner), 1986 and Paul and Kebarle, 1990; M
Quantity Value Units Method Reference Comment
Δr76.1 ± 8.4kJ/molIMRECaldwell, Rozeboom, et al., 1984gas phase; Reanchored to average data from Paul and Kebarle, 1990 and Meot-ner and Sieck, 1986.; value altered from reference due to change in acidity scale; B,M

Fluorine anion + Methyl Alcohol = (Fluorine anion • Methyl Alcohol)

By formula: F- + CH4O = (F- • CH4O)

Quantity Value Units Method Reference Comment
Δr124. ± 8.4kJ/molIMRELarson and McMahon, 1983gas phase; B,M
Δr123. ± 9.2kJ/molCIDTDeTuri and Ervin, 1999gas phase; B
Δr97.5 ± 8.4kJ/molTDAsHiraoka and Yamabe, 1991gas phase; B,M
Quantity Value Units Method Reference Comment
Δr105.J/mol*KPHPMSHiraoka and Yamabe, 1991gas phase; M
Δr94.6J/mol*KN/ALarson and McMahon, 1983gas phase; switching reaction(F-)H2O, Entropy change calculated or estimated; Arshadi, Yamdagni, et al., 1970; M
Quantity Value Units Method Reference Comment
Δr95.4 ± 8.4kJ/molIMRELarson and McMahon, 1983gas phase; B,M
Δr66.1 ± 8.4kJ/molTDAsHiraoka and Yamabe, 1991gas phase; B

(Chlorine anion • 3Methyl Alcohol) + Methyl Alcohol = (Chlorine anion • 4Methyl Alcohol)

By formula: (Cl- • 3CH4O) + CH4O = (Cl- • 4CH4O)

Quantity Value Units Method Reference Comment
Δr43.9 ± 4.2kJ/molTDAsHiraoka and Mizuse, 1987gas phase; B,M
Δr43.93kJ/molTDAsEvans and Keesee, 1991gas phase; B
Δr46.9 ± 2.5kJ/molTDAsYamdagni, Payzant, et al., 1973gas phase; B,M
Quantity Value Units Method Reference Comment
Δr95.8J/mol*KPHPMSHiraoka and Mizuse, 1987gas phase; M
Δr110.J/mol*KPHPMSYamdagni, Payzant, et al., 1973gas phase; M
Quantity Value Units Method Reference Comment
Δr15. ± 4.2kJ/molTDAsHiraoka and Mizuse, 1987gas phase; B
Δr15.5kJ/molTDAsEvans and Keesee, 1991gas phase; B
Δr13.8 ± 0.84kJ/molTDAsYamdagni, Payzant, et al., 1973gas phase; B

Bromine anion + Methyl Alcohol = (Bromine anion • Methyl Alcohol)

By formula: Br- + CH4O = (Br- • CH4O)

Quantity Value Units Method Reference Comment
Δr60.67 ± 0.42kJ/molTDAsBogdanov, Peschke, et al., 1999gas phase; B
Δr58.2 ± 4.2kJ/molTDAsHiraoka and Yamabe, 1991gas phase; B,M
Quantity Value Units Method Reference Comment
Δr73.6J/mol*KPHPMSHiraoka and Yamabe, 1991gas phase; M
Quantity Value Units Method Reference Comment
Δr33.5 ± 0.42kJ/molTDAsBogdanov, Peschke, et al., 1999gas phase; B
Δr36. ± 8.4kJ/molTDAsHiraoka and Yamabe, 1991gas phase; B
Δr35. ± 8.4kJ/molIMRETanabe, Morgon, et al., 1996gas phase; Anchored to H2O..Br- of Hiraoka, Mizure, et al., 19882; B

C3H9Si+ + Methyl Alcohol = (C3H9Si+ • Methyl Alcohol)

By formula: C3H9Si+ + CH4O = (C3H9Si+ • CH4O)

Quantity Value Units Method Reference Comment
Δr164.kJ/molPHPMSWojtyniak and Stone, 1986gas phase; switching reaction,Thermochemical ladder((CH3)3Si+)H2O, Entropy change calculated or estimated; M
Quantity Value Units Method Reference Comment
Δr124.J/mol*KN/AWojtyniak and Stone, 1986gas phase; switching reaction,Thermochemical ladder((CH3)3Si+)H2O, Entropy change calculated or estimated; M

Free energy of reaction

ΔrG° (kJ/mol) T (K) Method Reference Comment
106.468.PHPMSWojtyniak and Stone, 1986gas phase; switching reaction,Thermochemical ladder((CH3)3Si+)H2O, Entropy change calculated or estimated; M

Sodium ion (1+) + Methyl Alcohol = (Sodium ion (1+) • Methyl Alcohol)

By formula: Na+ + CH4O = (Na+ • CH4O)

Quantity Value Units Method Reference Comment
Δr97.1 ± 5.4kJ/molCIDCAmicangelo and Armentrout, 2001Anchor NH3=24.41; RCD
Δr91.6 ± 5.9kJ/molCIDTArmentrout and Rodgers, 2000RCD
Δr100. ± 0.8kJ/molHPMSHoyau, Norrman, et al., 1999RCD
Δr111. ± 0.8kJ/molHPMSGuo, Conklin, et al., 1989gas phase; M
Quantity Value Units Method Reference Comment
Δr85800.J/mol*KHPMSHoyau, Norrman, et al., 1999RCD
Δr102.J/mol*KHPMSGuo, Conklin, et al., 1989gas phase; M

Free energy of reaction

ΔrG° (kJ/mol) T (K) Method Reference Comment
72.4298.IMREMcMahon and Ohanessian, 2000Anchor alanine=39.89; RCD

(Chlorine anion • 4Methyl Alcohol) + Methyl Alcohol = (Chlorine anion • 5Methyl Alcohol)

By formula: (Cl- • 4CH4O) + CH4O = (Cl- • 5CH4O)

Quantity Value Units Method Reference Comment
Δr38. ± 4.2kJ/molTDAsHiraoka and Mizuse, 1987gas phase; B,M
Δr43.9 ± 2.1kJ/molN/AYamdagni, Payzant, et al., 1973gas phase; B,M
Quantity Value Units Method Reference Comment
Δr90.8J/mol*KPHPMSHiraoka and Mizuse, 1987gas phase; M
Δr107.J/mol*KPHPMSYamdagni, Payzant, et al., 1973gas phase; M
Quantity Value Units Method Reference Comment
Δr11. ± 4.2kJ/molTDAsHiraoka and Mizuse, 1987gas phase; B
Δr12.1 ± 0.42kJ/molTDAsYamdagni, Payzant, et al., 1973gas phase; B

Water + Propane, 2,2-dimethoxy- = 2Methyl Alcohol + Acetone

By formula: H2O + C5H12O2 = 2CH4O + C3H6O

Quantity Value Units Method Reference Comment
Δr20.3 ± 0.04kJ/molCmWiberg, Morgan, et al., 1994liquid phase; ALS
Δr20.43 ± 0.04kJ/molCmWiberg and Squires, 1979liquid phase; Heat of hydrolysis; ALS
Δr20.433 ± 0.028kJ/molCmWiberg and Squires, 1979, 2liquid phase; solvent: Water; Hydrolysis; ALS
Δr-16.5 ± 0.2kJ/molCmStern and Dorer, 1962liquid phase; Reanalyzed by Cox and Pilcher, 1970, Original value = 15.4 ± 0.2 kJ/mol; Heat of hydrolysis; ALS

(CH5O+ • Methyl Alcohol) + Methyl Alcohol = (CH5O+ • 2Methyl Alcohol)

By formula: (CH5O+ • CH4O) + CH4O = (CH5O+ • 2CH4O)

Bond type: Hydrogen bonds of the type OH-O between organics

Quantity Value Units Method Reference Comment
Δr88.7kJ/molPHPMSMeot-Ner (Mautner), 1992gas phase; M
Δr87.9kJ/molPHPMSMeot-Ner(Mautner), 1986gas phase; M
Δr89.1kJ/molPHPMSGrimsrud and Kebarle, 1973gas phase; M
Quantity Value Units Method Reference Comment
Δr113.J/mol*KPHPMSMeot-Ner (Mautner), 1992gas phase; M
Δr108.J/mol*KPHPMSMeot-Ner(Mautner), 1986gas phase; M
Δr118.J/mol*KPHPMSGrimsrud and Kebarle, 1973gas phase; M

C5H11O- + Methyl Alcohol = (C5H11O- • Methyl Alcohol)

By formula: C5H11O- + CH4O = (C5H11O- • CH4O)

Quantity Value Units Method Reference Comment
Δr108. ± 12.kJ/molN/ACaldwell, Rozeboom, et al., 1984gas phase; Reanchored to average data from Paul and Kebarle, 1990 and Meot-ner and Sieck, 1986.; value altered from reference due to change in acidity scale; B
Quantity Value Units Method Reference Comment
Δr71.1 ± 8.4kJ/molIMRECaldwell, Rozeboom, et al., 1984gas phase; Reanchored to average data from Paul and Kebarle, 1990 and Meot-ner and Sieck, 1986.; value altered from reference due to change in acidity scale; B

C6H11S2- + Methyl Alcohol = (C6H11S2- • Methyl Alcohol)

By formula: C6H11S2- + CH4O = (C6H11S2- • CH4O)

Quantity Value Units Method Reference Comment
Δr92. ± 10.kJ/molN/ACaldwell, Rozeboom, et al., 1984gas phase; Reanchored to average data from Paul and Kebarle, 1990 and Meot-ner and Sieck, 1986.; value altered from reference due to change in acidity scale; B
Quantity Value Units Method Reference Comment
Δr55.2 ± 6.7kJ/molIMRECaldwell, Rozeboom, et al., 1984gas phase; Reanchored to average data from Paul and Kebarle, 1990 and Meot-ner and Sieck, 1986.; value altered from reference due to change in acidity scale; B

(Copper ion (1+) • Methyl Alcohol) + Methyl Alcohol = (Copper ion (1+) • 2Methyl Alcohol)

By formula: (Cu+ • CH4O) + CH4O = (Cu+ • 2CH4O)

Quantity Value Units Method Reference Comment
Δr57.7kJ/molHPMSEl-Shall, Schriver, et al., 1989gas phase; Entropy change calculated or estimated, Cu+ from laser desorption; M
Quantity Value Units Method Reference Comment
Δr100.J/mol*KN/AEl-Shall, Schriver, et al., 1989gas phase; Entropy change calculated or estimated, Cu+ from laser desorption; M
Quantity Value Units Method Reference Comment
Δr26.kJ/molHPMSEl-Shall, Schriver, et al., 1989gas phase; Entropy change calculated or estimated, Cu+ from laser desorption; M

(CH5O+ • 2Water • 3Methyl Alcohol) + Water = (CH5O+ • 3Water • 3Methyl Alcohol)

By formula: (CH5O+ • 2H2O • 3CH4O) + H2O = (CH5O+ • 3H2O • 3CH4O)

Bond type: Hydrogen bond (positive ion to hydride)

Quantity Value Units Method Reference Comment
Δr38.kJ/molPHPMSMeot-Ner(Mautner), 1986gas phase; n, Entropy change calculated or estimated; M
Quantity Value Units Method Reference Comment
Δr92.J/mol*KN/AMeot-Ner(Mautner), 1986gas phase; n, Entropy change calculated or estimated; M

Free energy of reaction

ΔrG° (kJ/mol) T (K) Method Reference Comment
13.272.PHPMSMeot-Ner(Mautner), 1986gas phase; n, Entropy change calculated or estimated; M

(CH5O+ • 3Water • 2Methyl Alcohol) + Water = (CH5O+ • 4Water • 2Methyl Alcohol)

By formula: (CH5O+ • 3H2O • 2CH4O) + H2O = (CH5O+ • 4H2O • 2CH4O)

Bond type: Hydrogen bond (positive ion to hydride)

Quantity Value Units Method Reference Comment
Δr39.kJ/molPHPMSMeot-Ner(Mautner), 1986gas phase; n, Entropy change calculated or estimated; M
Quantity Value Units Method Reference Comment
Δr92.J/mol*KN/AMeot-Ner(Mautner), 1986gas phase; n, Entropy change calculated or estimated; M

Free energy of reaction

ΔrG° (kJ/mol) T (K) Method Reference Comment
13.272.PHPMSMeot-Ner(Mautner), 1986gas phase; n, Entropy change calculated or estimated; M

(CH5O+ • 4Water • Methyl Alcohol) + Water = (CH5O+ • 5Water • Methyl Alcohol)

By formula: (CH5O+ • 4H2O • CH4O) + H2O = (CH5O+ • 5H2O • CH4O)

Bond type: Hydrogen bond (positive ion to hydride)

Quantity Value Units Method Reference Comment
Δr39.kJ/molPHPMSMeot-Ner(Mautner), 1986gas phase; n, Entropy change calculated or estimated; M
Quantity Value Units Method Reference Comment
Δr92.J/mol*KN/AMeot-Ner(Mautner), 1986gas phase; n, Entropy change calculated or estimated; M

Free energy of reaction

ΔrG° (kJ/mol) T (K) Method Reference Comment
15.269.PHPMSMeot-Ner(Mautner), 1986gas phase; n, Entropy change calculated or estimated; M

(CH5O+ • Water) + Methyl Alcohol = (CH5O+ • Methyl Alcohol • Water)

By formula: (CH5O+ • H2O) + CH4O = (CH5O+ • CH4O • H2O)

Bond type: Hydrogen bonds of the type OH-O between organics

Quantity Value Units Method Reference Comment
Δr103.kJ/molPHPMSMeot-Ner(Mautner), 1986gas phase; n, Entropy change calculated or estimated; M
Quantity Value Units Method Reference Comment
Δr120.J/mol*KN/AMeot-Ner(Mautner), 1986gas phase; n, Entropy change calculated or estimated; M

Free energy of reaction

ΔrG° (kJ/mol) T (K) Method Reference Comment
48.5452.PHPMSMeot-Ner(Mautner), 1986gas phase; n, Entropy change calculated or estimated; M

C6H5NO2- + Methyl Alcohol = (C6H5NO2- • Methyl Alcohol)

By formula: C6H5NO2- + CH4O = (C6H5NO2- • CH4O)

Quantity Value Units Method Reference Comment
Δr63.18 ± 0.84kJ/molTDAsSieck, 1985gas phase; B,M
Quantity Value Units Method Reference Comment
Δr109.J/mol*KPHPMSSieck, 1985gas phase; M
Quantity Value Units Method Reference Comment
Δr30.5 ± 1.7kJ/molTDAsSieck, 1985gas phase; B
Δr26. ± 6.7kJ/molIMREChowdhury, Grimsrud, et al., 1987gas phase; Free energy affinity at 70°C.; B

Free energy of reaction

ΔrG° (kJ/mol) T (K) Method Reference Comment
26.343.PHPMSChowdhury, 1987gas phase; M

Copper ion (1+) + Methyl Alcohol = (Copper ion (1+) • Methyl Alcohol)

By formula: Cu+ + CH4O = (Cu+ • CH4O)

Quantity Value Units Method Reference Comment
Δr56.1kJ/molHPMSEl-Shall, Schriver, et al., 1989gas phase; Entropy change calculated or estimated, Cu+ from laser desorption; M
Quantity Value Units Method Reference Comment
Δr100.J/mol*KN/AEl-Shall, Schriver, et al., 1989gas phase; Entropy change calculated or estimated, Cu+ from laser desorption; M
Quantity Value Units Method Reference Comment
Δr25.kJ/molHPMSEl-Shall, Schriver, et al., 1989gas phase; Entropy change calculated or estimated, Cu+ from laser desorption; M

(Fluorine anion • Methyl Alcohol) + Methyl Alcohol = (Fluorine anion • 2Methyl Alcohol)

By formula: (F- • CH4O) + CH4O = (F- • 2CH4O)

Quantity Value Units Method Reference Comment
Δr84.9 ± 1.3kJ/molTDAsBogdanov, Peschke, et al., 1999gas phase; B
Δr80.8 ± 4.2kJ/molTDAsHiraoka and Yamabe, 1991gas phase; B,M
Quantity Value Units Method Reference Comment
Δr97.1J/mol*KPHPMSHiraoka and Yamabe, 1991gas phase; M
Quantity Value Units Method Reference Comment
Δr54.27kJ/molTDAsBogdanov, Peschke, et al., 1999gas phase; B
Δr51.9 ± 8.4kJ/molTDAsHiraoka and Yamabe, 1991gas phase; B

(Fluorine anion • 2Methyl Alcohol) + Methyl Alcohol = (Fluorine anion • 3Methyl Alcohol)

By formula: (F- • 2CH4O) + CH4O = (F- • 3CH4O)

Quantity Value Units Method Reference Comment
Δr63.2 ± 2.5kJ/molTDAsBogdanov, Peschke, et al., 1999gas phase; B
Δr60.7 ± 4.2kJ/molTDAsHiraoka and Yamabe, 1991gas phase; B,M
Quantity Value Units Method Reference Comment
Δr88.7J/mol*KPHPMSHiraoka and Yamabe, 1991gas phase; M
Quantity Value Units Method Reference Comment
Δr33.7kJ/molTDAsBogdanov, Peschke, et al., 1999gas phase; B
Δr34. ± 8.4kJ/molTDAsHiraoka and Yamabe, 1991gas phase; B

(Bromine anion • 2Methyl Alcohol) + Methyl Alcohol = (Bromine anion • 3Methyl Alcohol)

By formula: (Br- • 2CH4O) + CH4O = (Br- • 3CH4O)

Quantity Value Units Method Reference Comment
Δr39.7 ± 2.1kJ/molTDAsBogdanov, Peschke, et al., 1999gas phase; B
Δr44.4 ± 4.2kJ/molTDAsHiraoka and Yamabe, 1991gas phase; B,M
Quantity Value Units Method Reference Comment
Δr90.4J/mol*KPHPMSHiraoka and Yamabe, 1991gas phase; M
Quantity Value Units Method Reference Comment
Δr17.8kJ/molTDAsBogdanov, Peschke, et al., 1999gas phase; B
Δr18. ± 8.4kJ/molTDAsHiraoka and Yamabe, 1991gas phase; B

(Bromine anion • Methyl Alcohol) + Methyl Alcohol = (Bromine anion • 2Methyl Alcohol)

By formula: (Br- • CH4O) + CH4O = (Br- • 2CH4O)

Quantity Value Units Method Reference Comment
Δr50.21 ± 0.84kJ/molTDAsBogdanov, Peschke, et al., 1999gas phase; B
Δr52.3 ± 4.2kJ/molTDAsHiraoka and Yamabe, 1991gas phase; B,M
Quantity Value Units Method Reference Comment
Δr86.6J/mol*KPHPMSHiraoka and Yamabe, 1991gas phase; M
Quantity Value Units Method Reference Comment
Δr23.5kJ/molTDAsBogdanov, Peschke, et al., 1999gas phase; B
Δr26. ± 8.4kJ/molTDAsHiraoka and Yamabe, 1991gas phase; B

(Iodide • 2Methyl Alcohol) + Methyl Alcohol = (Iodide • 3Methyl Alcohol)

By formula: (I- • 2CH4O) + CH4O = (I- • 3CH4O)

Quantity Value Units Method Reference Comment
Δr32.2 ± 2.5kJ/molTDAsBogdanov, Peschke, et al., 1999gas phase; B
Δr41. ± 4.2kJ/molTDAsHiraoka and Yamabe, 1991gas phase; B,M
Quantity Value Units Method Reference Comment
Δr93.7J/mol*KPHPMSHiraoka and Yamabe, 1991gas phase; M
Quantity Value Units Method Reference Comment
Δr14.3kJ/molTDAsBogdanov, Peschke, et al., 1999gas phase; B
Δr13. ± 8.4kJ/molTDAsHiraoka and Yamabe, 1991gas phase; B

(Iodide • Methyl Alcohol) + Methyl Alcohol = (Iodide • 2Methyl Alcohol)

By formula: (I- • CH4O) + CH4O = (I- • 2CH4O)

Quantity Value Units Method Reference Comment
Δr39.7 ± 0.84kJ/molTDAsBogdanov, Peschke, et al., 1999gas phase; B
Δr46.4 ± 4.2kJ/molTDAsHiraoka and Yamabe, 1991gas phase; B,M
Quantity Value Units Method Reference Comment
Δr94.6J/mol*KPHPMSHiraoka and Yamabe, 1991gas phase; M
Quantity Value Units Method Reference Comment
Δr17.8kJ/molTDAsBogdanov, Peschke, et al., 1999gas phase; B
Δr18. ± 8.4kJ/molTDAsHiraoka and Yamabe, 1991gas phase; B

(Chlorine anion • 10Methyl Alcohol) + Methyl Alcohol = (Chlorine anion • 11Methyl Alcohol)

By formula: (Cl- • 10CH4O) + CH4O = (Cl- • 11CH4O)

Quantity Value Units Method Reference Comment
Δr31. ± 4.2kJ/molTDAsHiraoka and Mizuse, 1987gas phase; Estimated entropy; single temperature measurement; B,M
Quantity Value Units Method Reference Comment
Δr84.J/mol*KN/AHiraoka and Mizuse, 1987gas phase; Entropy change calculated or estimated; M
Quantity Value Units Method Reference Comment
Δr5.4 ± 4.2kJ/molTDAsHiraoka and Mizuse, 1987gas phase; Estimated entropy; single temperature measurement; B

(Sodium ion (1+) • Methyl Alcohol) + Methyl Alcohol = (Sodium ion (1+) • 2Methyl Alcohol)

By formula: (Na+ • CH4O) + CH4O = (Na+ • 2CH4O)

Quantity Value Units Method Reference Comment
Δr85.8 ± 5.9kJ/molCIDCAmicangelo and Armentrout, 2001Anchor NH3=24.41; RCD
Δr89.5 ± 6.7kJ/molCIDCAmicangelo and Armentrout, 2001Anchor NH3=24.41; RCD
Δr85.8 ± 6.7kJ/molCIDCAmicangelo and Armentrout, 2001Anchor NH3=24.41; RCD
Δr84.5 ± 0.8kJ/molHPMSGuo, Conklin, et al., 1989gas phase; M
Quantity Value Units Method Reference Comment
Δr90.8J/mol*KHPMSGuo, Conklin, et al., 1989gas phase; M

H4ClO2- + Methyl Alcohol + 2Water = CH8ClO3-

By formula: H4ClO2- + CH4O + 2H2O = CH8ClO3-

Quantity Value Units Method Reference Comment
Δr43.51 ± 0.84kJ/molTDAsEvans and Keesee, 1991gas phase; B
Δr47.7 ± 1.3kJ/molTDAsEvans and Keesee, 1991gas phase; For solvation by MeOH of core ion; B
Quantity Value Units Method Reference Comment
Δr24.3kJ/molTDAsEvans and Keesee, 1991gas phase; B
Δr25.1kJ/molTDAsEvans and Keesee, 1991gas phase; For solvation by MeOH of core ion; B

(CH5O+ • 2Methyl Alcohol) + Dimethyl ether = (CH5O+ • Dimethyl ether • 2Methyl Alcohol)

By formula: (CH5O+ • 2CH4O) + C2H6O = (CH5O+ • C2H6O • 2CH4O)

Bond type: Hydrogen bonds of the type OH-O between organics

Quantity Value Units Method Reference Comment
Δr72.0kJ/molPHPMSHiraoka, Grimsrud, et al., 1974gas phase; n, note proton affinities, core ion may be (CH3)2OH+; M
Quantity Value Units Method Reference Comment
Δr120.J/mol*KPHPMSHiraoka, Grimsrud, et al., 1974gas phase; n, note proton affinities, core ion may be (CH3)2OH+; M

(CH5O+ • 3Methyl Alcohol) + Dimethyl ether = (CH5O+ • Dimethyl ether • 3Methyl Alcohol)

By formula: (CH5O+ • 3CH4O) + C2H6O = (CH5O+ • C2H6O • 3CH4O)

Bond type: Hydrogen bonds of the type OH-O between organics

Quantity Value Units Method Reference Comment
Δr57.3kJ/molPHPMSHiraoka, Grimsrud, et al., 1974gas phase; n, note proton affinities, core ion may be (CH3)2OH+; M
Quantity Value Units Method Reference Comment
Δr129.J/mol*KPHPMSHiraoka, Grimsrud, et al., 1974gas phase; n, note proton affinities, core ion may be (CH3)2OH+; M

(CH5O+ • 2Methyl Alcohol) + Methyl Alcohol = (CH5O+ • 3Methyl Alcohol)

By formula: (CH5O+ • 2CH4O) + CH4O = (CH5O+ • 3CH4O)

Bond type: Hydrogen bonds of the type OH-O between organics

Quantity Value Units Method Reference Comment
Δr58.6kJ/molPHPMSMeot-Ner (Mautner), 1992gas phase; M
Δr67.4kJ/molPHPMSGrimsrud and Kebarle, 1973gas phase; M
Quantity Value Units Method Reference Comment
Δr100.J/mol*KPHPMSMeot-Ner (Mautner), 1992gas phase; M
Δr121.J/mol*KPHPMSGrimsrud and Kebarle, 1973gas phase; M

(CH5O+ • 3Methyl Alcohol) + Methyl Alcohol = (CH5O+ • 4Methyl Alcohol)

By formula: (CH5O+ • 3CH4O) + CH4O = (CH5O+ • 4CH4O)

Bond type: Hydrogen bonds of the type OH-O between organics

Quantity Value Units Method Reference Comment
Δr47.3kJ/molPHPMSMeot-Ner (Mautner), 1992gas phase; M
Δr56.5kJ/molPHPMSGrimsrud and Kebarle, 1973gas phase; M
Quantity Value Units Method Reference Comment
Δr93.3J/mol*KPHPMSMeot-Ner (Mautner), 1992gas phase; M
Δr120.J/mol*KPHPMSGrimsrud and Kebarle, 1973gas phase; M

(CH5O+ • 4Methyl Alcohol) + Methyl Alcohol = (CH5O+ • 5Methyl Alcohol)

By formula: (CH5O+ • 4CH4O) + CH4O = (CH5O+ • 5CH4O)

Bond type: Hydrogen bonds of the type OH-O between organics

Quantity Value Units Method Reference Comment
Δr42.7kJ/molPHPMSMeot-Ner (Mautner), 1992gas phase; M
Δr52.3kJ/molPHPMSGrimsrud and Kebarle, 1973gas phase; M
Quantity Value Units Method Reference Comment
Δr98.3J/mol*KPHPMSMeot-Ner (Mautner), 1992gas phase; M
Δr130.J/mol*KPHPMSGrimsrud and Kebarle, 1973gas phase; M

(CH5O+ • Methyl Alcohol) + Dimethyl ether = (CH5O+ • Dimethyl ether • Methyl Alcohol)

By formula: (CH5O+ • CH4O) + C2H6O = (CH5O+ • C2H6O • CH4O)

Bond type: Hydrogen bonds of the type OH-O between organics

Quantity Value Units Method Reference Comment
Δr91.6kJ/molPHPMSHiraoka, Grimsrud, et al., 1974gas phase; n, note proton affinities, core ion may be (CH3)2OH+; M
Quantity Value Units Method Reference Comment
Δr105.J/mol*KPHPMSHiraoka, Grimsrud, et al., 1974gas phase; n, note proton affinities, core ion may be (CH3)2OH+; M

(CH5O+ • 5Methyl Alcohol) + Methyl Alcohol = (CH5O+ • 6Methyl Alcohol)

By formula: (CH5O+ • 5CH4O) + CH4O = (CH5O+ • 6CH4O)

Bond type: Hydrogen bonds of the type OH-O between organics

Quantity Value Units Method Reference Comment
Δr39.kJ/molPHPMSMeot-Ner (Mautner), 1992gas phase; M
Δr49.8kJ/molPHPMSGrimsrud and Kebarle, 1973gas phase; M
Quantity Value Units Method Reference Comment
Δr98.3J/mol*KPHPMSMeot-Ner (Mautner), 1992gas phase; M
Δr138.J/mol*KPHPMSGrimsrud and Kebarle, 1973gas phase; M

(CH5O+ • 6Methyl Alcohol) + Methyl Alcohol = (CH5O+ • 7Methyl Alcohol)

By formula: (CH5O+ • 6CH4O) + CH4O = (CH5O+ • 7CH4O)

Bond type: Hydrogen bonds of the type OH-O between organics

Quantity Value Units Method Reference Comment
Δr38.kJ/molPHPMSMeot-Ner (Mautner), 1992gas phase; M
Δr50.2kJ/molPHPMSGrimsrud and Kebarle, 1973gas phase; M
Quantity Value Units Method Reference Comment
Δr108.J/mol*KPHPMSMeot-Ner (Mautner), 1992gas phase; M
Δr149.J/mol*KPHPMSGrimsrud and Kebarle, 1973gas phase; M

(Fluorine anion • 11Methyl Alcohol) + Methyl Alcohol = (Fluorine anion • 12Methyl Alcohol)

By formula: (F- • 11CH4O) + CH4O = (F- • 12CH4O)

Quantity Value Units Method Reference Comment
Δr36. ± 4.2kJ/molTDAsHiraoka and Yamabe, 1991gas phase; Entropy estimated.; B,M
Quantity Value Units Method Reference Comment
Δr100.J/mol*KN/AHiraoka and Yamabe, 1991gas phase; Entropy change calculated or estimated; M
Quantity Value Units Method Reference Comment
Δr4.6 ± 8.4kJ/molTDAsHiraoka and Yamabe, 1991gas phase; Entropy estimated.; B

Henry's Law data

Data compiled by: Rolf Sander

Henry's Law constant (water solution)

kH(T) = H exp(d(ln(kH))/d(1/T) ((1/T) - 1/(298.15 K)))
H = Henry's law constant for solubility in water at 298.15 K (mol/(kg*bar))
d(ln(kH))/d(1/T) = Temperature dependence constant (K)

H (mol/(kg*bar)) d(ln(kH))/d(1/T) (K) Method Reference Comment
140. QN/A missing citation give several references for the Henry's law constants but don't assign them to specific species.
220. XN/A
220.5200.MN/A
220. XN/AValue given here as quoted by missing citation.
160.5600.XN/A
230. MN/A
210. M,XTimmermans, 1960Value given here as quoted by missing citation.
230. MButler, Ramchandani, et al., 1935This paper supersedes earlier work with more concentrated solutions Butler, Thomson, et al., 1933.

References

Rossini, 1932
Rossini, F.D.,
The heats of combustion of methyl and ethyl alcohols,
J. Res. NBS, 1932, 8, 119-139. [all data]
Thermodynamics Research Center, 1997
Thermodynamics Research Center,
Selected Values of Properties of Chemical Compounds., Thermodynamics Research Center, Texas A&M University, College Station, Texas, 1997. [all data]
Ivash E.V., 1955
Ivash E.V.,
Thermodynamic properties of ideal gaseous methanol,
J. Chem. Phys., 1955, 23, 1814-1818. [all data]
Zhuravlev E.Z., 1959
Zhuravlev E.Z.,
Isotopic effect on thermodynamic functions of some organic deuterocompounds in the ideal gas state,
Tr. Khim. i Khim. Tekhnol., 1959, 2, 475-485. [all data]
Chen S.S., 1977
Chen S.S.,
Thermodynamic properties of normal and deuterated methanols,
J. Phys. Chem. Ref. Data, 1977, 6, 105-112. [all data]
Chao J., 1986
Chao J.,
Ideal gas thermodynamic properties of simple alkanols,
Int. J. Thermophys., 1986, 7, 431-442. [all data]
Gurvich, Veyts, et al., 1989
Gurvich, L.V.; Veyts, I.V.; Alcock, C.B.,
Thermodynamic Properties of Individual Substances, 4th ed.; Vols. 1 and 2, Hemisphere, New York, 1989. [all data]
Chao J., 1986, 2
Chao J.,
Thermodynamic properties of key organic oxygen compounds in the carbon range C1 to C4. Part 2. Ideal gas properties,
J. Phys. Chem. Ref. Data, 1986, 15, 1369-1436. [all data]
Stromsoe E., 1970
Stromsoe E.,
Heat capacity of alcohol vapors at atmospheric pressure,
J. Chem. Eng. Data, 1970, 15, 286-290. [all data]
Halford J.O., 1957
Halford J.O.,
Standard heat capacities of gaseous methanol, ethanol, methane and ethane at 279 K by thermal conductivity,
J. Phys. Chem., 1957, 61, 1536-1539. [all data]
De Vries T., 1941
De Vries T.,
The heat capacity of organic vapors. I. Methyl alcohol,
J. Am. Chem. Soc., 1941, 63, 1343-1346. [all data]
Weltner W., 1951
Weltner W., Jr.,
Methyl alcohol: the entropy, heat capacity and polymerization equilibria in the vapor, and potential barrier to internal rotation,
J. Am. Chem. Soc., 1951, 73, 2606-2610. [all data]
Hunter and Lias, 1998
Hunter, E.P.; Lias, S.G.,
Evaluated Gas Phase Basicities and Proton Affinities of Molecules: An Update,
J. Phys. Chem. Ref. Data, 1998, 27, 3, 413-656, https://doi.org/10.1063/1.556018
. [all data]
Tao, Klemm, et al., 1992
Tao, W.; Klemm, R.B.; Nesbitt, F.L.; Stief, J.L.,
A discharge flow-photoionization mass spectrometric study of hydroxymethyl radicals (H2COH and H2COD): Photoionization spectrum and ionization energy,
J. Phys. Chem., 1992, 96, 104. [all data]
Holmes and Lossing, 1991
Holmes, J.L.; Lossing, F.P.,
Ionization energies of homologous organic compounds and correlation with molecular size,
Org. Mass Spectrom., 1991, 26, 537. [all data]
Bowen and Maccoll, 1984
Bowen, R.D.; Maccoll, A.,
Low energy, low temperature mass spectra,
Org. Mass Spectrom., 1984, 19, 379. [all data]
Mishchanchuk, Pokrovskii, et al., 1982
Mishchanchuk, B.G.; Pokrovskii, V.A.; Shabel'nikov, V.P.; Korol, E.N.,
Mass spectrometric study of energy characteristics of methanol and ethanol ions during ionization by a strong electric field,
Teor. Eksp. Khim., 1982, 18, 307. [all data]
Allam, Migahed, et al., 1982
Allam, S.H.; Migahed, M.D.; El-Khodary, A.,
Electron impact ionization and dissociation of deuterated and non-deuterated methanol, methyl cyanide, nitromethane and nitrobenzene,
Egypt. J. Phys., 1982, 13, 167. [all data]
Sahini, Constantin, et al., 1978
Sahini, V.E.; Constantin, V.; Serban, I.,
Determination of ionization potentials using a MI-1305 mass spectrometer,
Rev. Roum. Chim., 1978, 23, 479. [all data]
Berkowitz, 1978
Berkowitz, J.,
Photoionization of CH3OH, CD3OH, and CH3OD: Dissociative ionization mechanisms and ionic structures,
J. Chem. Phys., 1978, 69, 3044. [all data]
MacNeil and Dixon, 1977
MacNeil, K.A.G.; Dixon, R.N.,
High-resolution photoelectron spectroscopy of methanol and its deuterated derivatives: Internal rotation in the ground ionic state,
J. Electron Spectrosc. Relat. Phenom., 1977, 11, 315. [all data]
Finney and Harrison, 1972
Finney, C.D.; Harrison, A.G.,
A third-derivative method for determining electron-impact onset potentials,
Int. J. Mass Spectrom. Ion Phys., 1972, 9, 221. [all data]
Warneck, 1971
Warneck, P.,
Photoionisation von methanol und formaldehyd,
Z. Naturforsch. A:, 1971, 26, 2047. [all data]
Cocksey, Eland, et al., 1971
Cocksey, B.J.; Eland, J.H.D.; Danby, C.J.,
The effect of alkyl substitution on ionisation potential,
J. Chem. Soc., 1971, (B), 790. [all data]
Baker, Betteridge, et al., 1971
Baker, A.D.; Betteridge, D.; Kemp, N.R.; Kirby, R.E.,
Application of photoelectron spectrometry to pesticide analysis. II.Photoelectron spectra of hydroxy-, and halo-alkanes and halohydrins,
Anal. Chem., 1971, 43, 375. [all data]
Omura, Kaneko, et al., 1969
Omura, I.; Kaneko, T.; Yamada, Y.; Tanaka, K.,
Mass spectrometric studies of photoionization. V. Methanol and methanol-d,
J. Phys. Soc. Japan, 1969, 27, 981. [all data]
Lifshitz, Shapiro, et al., 1969
Lifshitz, C.; Shapiro, M.; Sternberg, R.,
Isotopic effects on metastable transitions. IV. Isotopic methanols,
Israel J. Chem., 1969, 7, 391. [all data]
Dewar and Worley, 1969
Dewar, M.J.S.; Worley, S.D.,
Photoelectron spectra of molecules. I. Ionization potentials of some organic molecules and their interpretation,
J. Chem. Phys., 1969, 50, 654. [all data]
Refaey and Chupka, 1968
Refaey, K.M.A.; Chupka, W.A.,
Photoionization of the lower aliphatic alcohols with mass analysis,
J. Chem. Phys., 1968, 48, 5205. [all data]
Cermak, 1968
Cermak, V.,
Penning ionization electron spectroscopy. I. Determination of ionization potentials of polyatomic molecules,
Collection Czech. Chem. Commun., 1968, 33, 2739. [all data]
Al-Joboury and Turner, 1964
Al-Joboury, M.I.; Turner, D.W.,
Molecular photoelectron spectroscopy. Part II. A summary of ionization potentials,
J. Chem. Soc., 1964, 4434. [all data]
Watanabe, 1954
Watanabe, K.,
Photoionization and total absorption cross section of gases. I. Ionization potentials of several molecules. Cross sections of NH3 and NO,
J. Chem. Phys., 1954, 22, 1564. [all data]
Vorob'ev, Furlei, et al., 1989
Vorob'ev, A.S.; Furlei, I.I.; Sultanov, A.S.; Khvostenko, V.I.; Leplyanin, G.V.; Derzhinskii, A.R.; Tolstikov, G.A.,
Mass spectrometry of reasonance capture of electrons and photoelectron spectroscopy of molecules of ethylene oxide, ethylene sulfide, and their derivatives,
Bull. Acad. Sci. USSR, Div. Chem. Sci., 1989, 1388. [all data]
Von Niessen, Bieri, et al., 1980
Von Niessen, W.; Bieri, G.; Asbrink, L.,
30.4 nm He(II) photoelectron spectra of organic molecules. Part III. Oxo-compounds (C,H,O),
J. Electron Spectrosc. Relat. Phenom., 1980, 21, 175. [all data]
Utsunomiya, Kobayashi, et al., 1980
Utsunomiya, C.; Kobayashi, T.; Nagakura, S.,
Photoelectron angular distribution measurements for some aliphatic alcohols, amines, halides,
Bull. Chem. Soc. Jpn., 1980, 53, 1216. [all data]
Kobayashi, 1978
Kobayashi, T.,
A simple general tendency in photoelectron angular distributions of some monosubstituted benzenes,
Phys. Lett., 1978, 69, 105. [all data]
Benoit and Harrison, 1977
Benoit, F.M.; Harrison, A.G.,
Predictive value of proton affinity. Ionization energy correlations involving oxygenated molecules,
J. Am. Chem. Soc., 1977, 99, 3980. [all data]
Peel and Willett, 1975
Peel, J.B.; Willett, G.D.,
Photoelectron spectroscopic studies of the higher alcohols,
Aust. J. Chem., 1975, 28, 2357. [all data]
Robin and Kuebler, 1973
Robin, M.B.; Kuebler, N.A.,
Excited electronic states of the simple alcohols,
J. Electron Spectrosc. Relat. Phenom., 1973, 1, 13. [all data]
Ogata, Onizuka, et al., 1973
Ogata, H.; Onizuka, H.; Nihei, Y.; Kamada, H.,
The photoelectron spectra of alcohols, mercaptans and amines,
Bull. Chem. Soc. Jpn., 1973, 46, 3036. [all data]
Katsumata, Iwai, et al., 1973
Katsumata, S.; Iwai, T.; Kimura, K.,
Photoelectron spectra and sum rule consideration. Higher alkyl amines and alcohols,
Bull. Chem. Soc. Jpn., 1973, 46, 3391. [all data]
Ogata, Onizuka, et al., 1972
Ogata, H.; Onizuka, H.; Nihei, Y.; Kamada, H.,
On the first bands of the photoelectron spectra of amines, alcohols, and mercaptans,
Chem. Lett., 1972, 895. [all data]
Reed and Snedden, 1956
Reed, R.I.; Snedden, W.,
Studies in electron impact methods. Part 6.-The formation of the methine and carbon ions,
J. Chem. Soc. Faraday Trans., 1956, 55, 876. [all data]
Haney and Franklin, 1968
Haney, M.A.; Franklin, J.L.,
Correlation of excess energies of electron-impact dissociations with the translational energies of the products,
J.Chem. Phys., 1968, 48, 4093. [all data]
Friedman, Long, et al., 1957
Friedman, L.; Long, F.A.; Wolfsberg, M.,
Study of the mass spectra of the lower aliphatic alcohols,
J. Chem. Phys., 1957, 27, 613. [all data]
Selim and Helal, 1981
Selim, E.T.M.; Helal, A.I.,
Heat of formation of CH2=OH+ fragment ion,
Indian J. Pure Appl. Phys., 1981, 19, 977. [all data]
Lossing, 1977
Lossing, F.P.,
Heats of formation of some isomeric [CnH2n+1]+ ions. Substitutional effects on ion stability,
J. Am. Chem. Soc., 1977, 99, 7526. [all data]
Berkowitz, Ellison, et al., 1994
Berkowitz, J.; Ellison, G.B.; Gutman, D.,
Three methods to measure RH bond energies,
J. Phys. Chem., 1994, 98, 2744. [all data]
Friedland and Strakna, 1956
Friedland, S.S.; Strakna, R.E.,
Appearance potential studies. I,
J. Phys. Chem., 1956, 60, 815. [all data]
Nee, Osterwalder, et al., 2006
Nee, M.J.; Osterwalder, A.; Zhou, J.; Neumark, D.M.,
Slow electron velocity-map imaging photoelectron spectra of the methoxide anion,
J. Chem. Phys., 2006, 125, 1, 014306, https://doi.org/10.1063/1.2212411
. [all data]
Osborn, Leahy, et al., 1998
Osborn, D.L.; Leahy, D.J.; Kim, E.H.; deBeer, E.; Neumark, D.M.,
Photoelectron spectroscopy of CH3O- and CD3O-,
Chem. Phys. Lett., 1998, 292, 4-6, 651-655, https://doi.org/10.1016/S0009-2614(98)00717-9
. [all data]
Bartmess, Scott, et al., 1979
Bartmess, J.E.; Scott, J.A.; McIver, R.T., Jr.,
The gas phase acidity scale from methanol to phenol,
J. Am. Chem. Soc., 1979, 101, 6047. [all data]
Haas and Harrison, 1993
Haas, M.J.; Harrison, A.G.,
The Fragmentation of Proton-Bound Cluster Ions and the Gas-Phase Acidities of Alcohols,
Int. J. Mass Spectrom. Ion Proc., 1993, 124, 2, 115, https://doi.org/10.1016/0168-1176(93)80003-W
. [all data]
Meot-ner and Sieck, 1986
Meot-ner, M.; Sieck, L.W.,
Relative acidities of water and methanol, and the stabilities of the dimer adducts,
J. Phys. Chem., 1986, 90, 6687. [all data]
Bogdanov, Peschke, et al., 1999
Bogdanov, B.; Peschke, M.; Tonner, D.S.; Szulejko, J.E.; McMahon, T.B.,
Stepwise solvation of halides by alcohol molecules in the gas phase,
Int. J. Mass Spectrom., 1999, 187, 707-725, https://doi.org/10.1016/S1387-3806(98)14180-5
. [all data]
Hiraoka and Yamabe, 1991
Hiraoka, K.; Yamabe, S.,
Solvation of Halide Ions with CH3OH in the gas Phase,
Int. J. Mass Spectrom. Ion Proc., 1991, 109, 133, https://doi.org/10.1016/0168-1176(91)85101-Q
. [all data]
Tanabe, Morgon, et al., 1996
Tanabe, F.K.J.; Morgon, N.H.; Riveros, J.M.,
Relative Bromide and Iodide Affinity of Simple Solvent Molecules Determined by FT-ICR,
J. Phys. Chem., 1996, 100, 8, 2862-2866, https://doi.org/10.1021/jp952290p
. [all data]
Hiraoka, Mizure, et al., 1988
Hiraoka, K.; Mizure, S.; Yamabe, S.; Nakatsuji, Y.,
Gas Phase Clustering Reactions of CN- and CH2CN- with MeCN,
Chem. Phys. Lett., 1988, 148, 6, 497, https://doi.org/10.1016/0009-2614(88)80320-8
. [all data]
Meot-Ner and Sieck, 1986
Meot-Ner, M.; Sieck, L.W.,
The ionic hydrogen bond and ion solvation. 5. OH...O- bonds. Gas phase solvation and clustering of alkoxide and carboxylate anions,
J. Am. Chem. Soc., 1986, 108, 7525. [all data]
Paul and Kebarle, 1990
Paul, G.J.C.; Kebarle, P.,
Thermodynamics of the Association Reactions OH- - H2O = HOHOH- and CH3O- - CH3OH = CH3OHOCH3- in the Gas Phase,
J. Phys. Chem., 1990, 94, 12, 5184, https://doi.org/10.1021/j100375a076
. [all data]
Caldwell, Rozeboom, et al., 1984
Caldwell, G.; Rozeboom, M.D.; Kiplinger, J.P.; Bartmess, J.E.,
Anion-alcohol hydrogen bond strengths in the gas phase,
J. Am. Chem. Soc., 1984, 106, 4660. [all data]
Moylan, Dodd, et al., 1985
Moylan, C.R.; Dodd, J.A.; Brauman, J.I.,
Electron photodetachment spectroscopy of Sslvated anions. A probe of structure and energetics,
Chem. Phys. Lett., 1985, 118, 38. [all data]
Meot-Ner(Mautner), 1986
Meot-Ner(Mautner), M.,
Comparative Stabilities of Cationic and Anionic Hydrogen-Bonded Networks. Mixed Clusters of Water-Methanol,
J. Am. Chem. Soc., 1986, 108, 20, 6189, https://doi.org/10.1021/ja00280a014
. [all data]
Mustanir, Matsuoka, et al., 2006
Mustanir; Matsuoka, M.; Mishima, M.; Koch, H.,
Stability of complexes of phenylacetylides and benzyl alkoxides with methanol in the gas phase. Acid-base correlation in the ionic hydrogen-bond strength,
Bull. Chem. Soc. Japan, 2006, 79, 7, 1118-1125, https://doi.org/10.1246/bcsj.79.1118
. [all data]
MacKay and Bohme, 1978
MacKay, G.I.; Bohme, D.K.,
Proton-Transfer Reactions in Nitromethane at 297K,
Int. J. Mass Spectrom. Ion Phys., 1978, 26, 4, 327, https://doi.org/10.1016/0020-7381(78)80052-7
. [all data]
Meot-Ner (Mautner), 1992
Meot-Ner (Mautner), M.,
Intermolecular Forces in Organic Clusters,
J. Am. Chem. Soc., 1992, 114, 9, 3312, https://doi.org/10.1021/ja00035a024
. [all data]
Szulejko and McMahon, 1992
Szulejko, J.; McMahon, T.B.,
personal communication, 1992. [all data]
Grimsrud and Kebarle, 1973
Grimsrud, E.P.; Kebarle, P.,
Gas Phase Ion Equilibria Studies of the Solvation of the Hydrogen Ion by Methanol, Dimethyl Ether and Water. Effect of Hydrogen Bonding,
J. Am. Chem. Soc., 1973, 95, 24, 7939, https://doi.org/10.1021/ja00805a002
. [all data]
Larson and McMahon, 1982
Larson, J.W.; McMahon, T.B.,
Formation, Thermochemistry, and Relative Stabilities of Proton - Bound dimers of Oxygen n - Donor Bases from Ion Cyclotron Resonance Solvent - Exchange Equilibria Measurements,
J. Am. Chem. Soc., 1982, 104, 23, 6255, https://doi.org/10.1021/ja00387a016
. [all data]
Lias, Liebman, et al., 1984
Lias, S.G.; Liebman, J.F.; Levin, R.D.,
Evaluated gas phase basicities and proton affinities of molecules heats of formation of protonated molecules,
J. Phys. Chem. Ref. Data, 1984, 13, 695. [all data]
Keesee and Castleman, 1986
Keesee, R.G.; Castleman, A.W., Jr.,
Thermochemical data on Ggs-phase ion-molecule association and clustering reactions,
J. Phys. Chem. Ref. Data, 1986, 15, 1011. [all data]
Meot-Ner, 1984
Meot-Ner, (Mautner)M.,
The Ionic Hydrogen Bond and Ion Solvation. 1. -NH+ O-, -NH+ N- and -OH+ O- Bonds. Correlations with Proton Affinity. Deviations Due to Structural Effects,
J. Am. Chem. Soc., 1984, 106, 5, 1257, https://doi.org/10.1021/ja00317a015
. [all data]
Larson, Szulejko, et al., 1988
Larson, J.W.; Szulejko, J.E.; McMahon, T.B.,
Gas Phase Lewis Acid-Base Interactions. An Experimental Determination of Cyanide Binding Energies From Ion Cyclotron Resonance and High-Pressure Mass Spectrometric Equilibrium Measurements.,
J. Am. Chem. Soc., 1988, 110, 23, 7604, https://doi.org/10.1021/ja00231a004
. [all data]
Meot-ner, 1988
Meot-ner, M.,
Ionic Hydrogen Bond and Ion Solvation. 6. Interaction Energies of the Acetate Ion with Organic Molecules. Comparison of CH3COO- with Cl-, CN-, and SH-,
J. Am. Chem. Soc., 1988, 110, 12, 3854, https://doi.org/10.1021/ja00220a022
. [all data]
Larson and McMahon, 1987
Larson, J.W.; McMahon, T.B.,
Hydrogen bonding in gas phase anions. The energetics of interaction between cyanide ion and bronsted acids,
J. Am. Chem. Soc., 1987, 109, 6230. [all data]
Payzant, Yamdagni, et al., 1971
Payzant, J.D.; Yamdagni, R.; Kebarle, P.,
Hydration of CN-, NO2-, NO3-, and HO- in the gas phase,
Can. J. Chem., 1971, 49, 3308. [all data]
Chabinyc and Brauman, 1999
Chabinyc, M.L.; Brauman, J.I.,
Hydrogen bond strength and acidity. Structural and energetic correlations for acetylides and alcohols,
J. Phys. Chem. A, 1999, 103, 46, 9163-9166, https://doi.org/10.1021/jp992852v
. [all data]
El-Shall, Olafsdottir, et al., 1991
El-Shall, M.S.; Olafsdottir, S.; Meot-ner (Mautner), M.; Sieck, L.W.,
Energy effects on cluster ion distributions: Beam expansion and thermochemical studies on mixed clusters of methanol and acetonitrile,
Chem. Phys. Lett., 1991, 185, 3-4, 193, https://doi.org/10.1016/S0009-2614(91)85046-Y
. [all data]
Nieckarz, Atkins, et al., 2008
Nieckarz, R.J.; Atkins, C.G.; McMahon, T.B.,
Effects of Isomerization on the Measured Thermochemical Properties of Deprotonated Glycine/Protic-Solvent Clusters,
Chemphyschem, 2008, 9, 18, 2816-2825, https://doi.org/10.1002/cphc.200800525
. [all data]
DeTuri and Ervin, 1999
DeTuri, V.F.; Ervin, K.M.,
Competitive threshold collision-induced dissociation: Gas-phase acidities and bond dissociation energies for a series of alcohols,
J. Phys. Chem. A, 1999, 103, 35, 6911-6920, https://doi.org/10.1021/jp991459m
. [all data]
Mackay, Rakshit, et al., 1982
Mackay, G.I.; Rakshit, A.B.; Bohme, D.K.,
An Experimental Study of the Reactivity and Relative Basicity of the Methoxide Anion in the Gas Phase at Room Temperature, and their Perturbation by Methanol Solvent,
Can. J. Chem., 1982, 60, 20, 2594, https://doi.org/10.1139/v82-373
. [all data]
Caldwell and Kebarle, 1986
Caldwell, G.; Kebarle, P.,
Mobility of Gaseous Ions in Weak Electric Fields
in Unpublished results, 1986. [all data]
Taft, 1983
Taft, R.W.,
Protonic acidities and basicities in the gas phase and in solution: Substiuent and solvent effects,
Prog. Phys. Org. Chem., 1983, 14, 247. [all data]
Hiraoka, Grimsrud, et al., 1974
Hiraoka, K.; Grimsrud, E.P.; Kebarle, P.,
Gas Phase Ion Equilibria Studies of the Hydrogen Ion in Water - Dimethyl Ether and Methanol - Dimethyl Ether Mixtures,
J. Am. Chem. Soc., 1974, 96, 11, 3359, https://doi.org/10.1021/ja00818a004
. [all data]
Meot-Ner (Mautner), 1988
Meot-Ner (Mautner), M.,
Models for Strong Interactions in Proteins and Enzymes. 2. Interactions of Ions with the Peptide Link and Imidazole,
J. Am. Chem. Soc., 1988, 110, 10, 3075, https://doi.org/10.1021/ja00218a014
. [all data]
Meot-Ner (Mautner), Ross, et al., 1985
Meot-Ner (Mautner), M.; Ross, M.M.; Campana, J.E.,
Stable Hydrogen - Bonded Isomers of Covalent Ions,
J. Am. Chem. Soc., 1985, 107, 4835. [all data]
Wojtyniak and Stone, 1986
Wojtyniak, A.C.M.; Stone, A.J.,
A High-Pressure Mass Spectrometric Study of the Bonding of Trimethylsilylium to Oxygen and Aromatic Bases,
Can. J. Chem., 1986, 74, 59. [all data]
Stone and Splinter, 1984
Stone, J.A.; Splinter, D.E.,
A high-pressure mass spectrometric study of the binding of (CH3)3Sn+ to lewis bases in the gas phase,
Int. J. Mass Spectrom. Ion Processes, 1984, 59, 169. [all data]
El-Shall, Daly, et al., 1992
El-Shall, M.S.; Daly, G.M.; Gao, J.; Meot-Ner (Mautner), M.; Sieck, L.W.,
How Sensitive are Cluster Compositions to Energetics? A Joint Beam Expansion/ Thermochemical Study of Water - Methanol - Trimethylamine Clusters,
J. Phys. Chem., 1992, 96, 2, 507, https://doi.org/10.1021/j100181a002
. [all data]
Chowdhury, Grimsrud, et al., 1987
Chowdhury, S.; Grimsrud, E.P.; Kebarle, P.,
Bonding of Charged Delocalized Anions to Protic and Dipolar Aprotic Solvent Molecules,
J. Phys. Chem., 1987, 91, 10, 2551, https://doi.org/10.1021/j100294a021
. [all data]
Chowdhury, 1987
Chowdhury, S. Grimsrud,
Bonding of Charge Delocalized Anions to Protic and Dipolar Aprotic Solvents,
J. Phys. Chem., 1987, 91, 10, 2551, https://doi.org/10.1021/j100294a021
. [all data]
Meot-ner, 1988, 2
Meot-ner, M.,
The Ionic Hydrogen Bond and Solvation. 7. Interaction Energies of Carbanions with Solvent Molecules,
J. Am. Chem. Soc., 1988, 110, 12, 3858, https://doi.org/10.1021/ja00220a022
. [all data]
Meot-Ner (Mautner), Sieck, et al., 1994
Meot-Ner (Mautner), M.; Sieck, L.W.; Liebman, J.F.; Scheiner, S.; Duan, X.,
The Ionic Hydrogen Bond. 5. Polydentate and Solvent-Bridged Structures. Complexing of the Proton and the Hydronium Ions by Polyethers,
J. Am. Chem. Soc., 1994, 116, 17, 7848, https://doi.org/10.1021/ja00096a047
. [all data]
Sieck, 1985
Sieck, L.W.,
Thermochemistry of Solvation of NO2- and C6H5NO2- by Polar Molecules in the Vapor Phase. Comparison with Cl- and Variation with Ligand Structure.,
J. Phys. Chem., 1985, 89, 25, 5552, https://doi.org/10.1021/j100271a049
. [all data]
Sieck and Meot-ner, 1989
Sieck, L.W.; Meot-ner, M.,
Ionic Hydrogen Bond and Ion Solvation. 8. RS-..HOR Bond Strengths. Correlation with Acidities.,
J. Phys. Chem., 1989, 93, 4, 1586, https://doi.org/10.1021/j100341a079
. [all data]
Knighton, Zook, et al., 1990
Knighton, W.B.; Zook, D.R.; Grimsrud, E.P.,
Cluster-Assisted Decomposition Reactions of the Molecular Anions of SF6 and C7F14,
J. Am. Soc. Mass Spectrom., 1990, 1, 5, 372, https://doi.org/10.1016/1044-0305(90)85017-G
. [all data]
Sharma and Kebarle, 1984
Sharma, R.B.; Kebarle, P.,
Stabilites and Hydrogen Bonding in Complexes of H3O+ and CH3OH2+ with Crown Ethers, from Measurements of Gas - Phase Ion - Molecule Equilibria,
J. Am. Chem. Soc., 1984, 106, 14, 3913, https://doi.org/10.1021/ja00326a005
. [all data]
Evans and Keesee, 1991
Evans, D.H.; Keesee, R.G.,
Thermodynamics of Gas-Phase Mixed-Solvent Cluster Ions - Water and Methanol on K+ and Cl- and Comparison to Liquid Solutions,
J. Phys. Chem., 1991, 95, 9, 3558, https://doi.org/10.1021/j100162a024
. [all data]
Hiraoka and Mizuse, 1987
Hiraoka, K.; Mizuse, S.,
Gas-Phase Solvation of Cl- with H2O, CH3OH, C2H4OH, i-C3H7OH, n-C3H7OH, and t-C4H9OH,
Chem. Phys., 1987, 118, 3, 457, https://doi.org/10.1016/0301-0104(87)85078-4
. [all data]
Larson and McMahon, 1984
Larson, J.W.; McMahon, T.B.,
Gas phase negative ion chemistry of alkylchloroformates,
Can. J. Chem., 1984, 62, 675. [all data]
French, Ikuta, et al., 1982
French, M.A.; Ikuta, S.; Kebarle, P.,
Hydrogen bonding of O-H and C-H hydrogen donors to Cl-. Results from mass spectrometric measurement of the ion-molecule equilibria RH + Cl- = RHCl-,
Can. J. Chem., 1982, 60, 1907. [all data]
Yamdagni, Payzant, et al., 1973
Yamdagni, R.; Payzant, J.D.; Kebarle, P.,
Solvation of Cl- and O2- with H2O, CH3OH, and CH3CN in the gas phase,
Can. J. Chem., 1973, 51, 2507. [all data]
Rodgers and Armentrout, 2000
Rodgers, M.T.; Armentrout, P.B.,
Noncovalent Metal-Ligand Bond Energies as Studied by Threshold Collision-Induced Dissociation,
Mass Spectrom. Rev., 2000, 19, 4, 215, https://doi.org/10.1002/1098-2787(200007)19:4<215::AID-MAS2>3.0.CO;2-X
. [all data]
El-Shall, Schriver, et al., 1989
El-Shall, M.S.; Schriver, K.E.; Whetten, R.L.; Meot-Ner (Mautner), M.,
Ion/Molecule Clustering Thermochemistry by Laser Ionization High - Pressure Mass Spectrometry,
J. Phys. Chem., 1989, 93, 24, 7969, https://doi.org/10.1021/j100361a002
. [all data]
Wilkinson, Szulejko, et al., 1992
Wilkinson, F.E.; Szulejko, J.E.; Allison, C.E.; Mcmahon, T.B.,
Fourier Transform Ion Cyclotron Resonance Investigation of the Deuterium Isotope Effect on Gas Phase Ion/Molecule Hydrogen Bonding Interactions in Alcohol-Fluoride Adduct Ions,
Int. J. Mass Spectrom., 1992, 117, 487-505, https://doi.org/10.1016/0168-1176(92)80110-M
. [all data]
Larson and McMahon, 1983
Larson, J.W.; McMahon, T.B.,
Strong hydrogen bonding in gas-phase anions. An ion cyclotron resonance determination of fluoride binding energetics to bronsted acids from gas-phase fluoride exchange equilibria measurements,
J. Am. Chem. Soc., 1983, 105, 2944. [all data]
Arshadi, Yamdagni, et al., 1970
Arshadi, M.; Yamdagni, R.; Kebarle, P.,
Hydration of Halide Negative Ions in the Gas Phase. II. Comparison of Hydration Energies for the Alkali Positive and Halide Negative Ions,
J. Phys. Chem., 1970, 74, 7, 1475, https://doi.org/10.1021/j100702a014
. [all data]
Caldwell and Kebarle, 1984
Caldwell, G.; Kebarle, P.,
Binding energies and structural effects in halide anion-ROH and -RCOOH complexes from gas phase equilibria measurements,
J. Am. Chem. Soc., 1984, 106, 967. [all data]
Caldwell, Masucci, et al., 1989
Caldwell, G.W.; Masucci, J.A.; Ikonomou, M.G.,
Negative Ion Chemical Ionization Mass Spectrometry - Binding of Molecules to Bromide and Iodide Anions,
Org. Mass Spectrom., 1989, 24, 1, 8, https://doi.org/10.1002/oms.1210240103
. [all data]
Woodin and Beauchamp, 1978
Woodin, R.L.; Beauchamp, J.L.,
Bonding of Li+ to Lewis Bases in the Gas Phase. Reversals in Methyl Substituent Effects for Different Reference Acids,
J. Am. Chem. Soc., 1978, 100, 2, 501, https://doi.org/10.1021/ja00470a024
. [all data]
Dzidic and Kebarle, 1970
Dzidic, I.; Kebarle, P.,
Hydration of the Alkali Ions in the Gas Phase. Enthalpies and Entropies of Reactions M+(H2O)n-1 + H2O = M+(H2O)n,
J. Phys. Chem., 1970, 74, 7, 1466, https://doi.org/10.1021/j100702a013
. [all data]
Staley and Beauchamp, 1975
Staley, R.H.; Beauchamp, J.L.,
Intrinsic Acid - Base Properties of Molecules. Binding Energies of Li+ to pi - and n - Donor Bases,
J. Am. Chem. Soc., 1975, 97, 20, 5920, https://doi.org/10.1021/ja00853a050
. [all data]
Andersen, Muntean, et al., 2000
Andersen, A.; Muntean, F.; Walter, D.; Rue, C.; Armentrout, P.B.,
Collision-Induced Dissociation and Theoretical Studies of Mg+ Complexes with CO, CO2, NH3, CH4, CH3OH, and C6H6,
J. Phys. Chem. A, 2000, 104, 4, 692, https://doi.org/10.1021/jp993031t
. [all data]
Operti, Tews, et al., 1988
Operti, L.; Tews, E.C.; Freiser, B.S.,
Determination of Gas-Phase Ligand Binding Energies to Mg+ by FTMS Techniques,
J. Am. Chem. Soc., 1988, 110, 12, 3847, https://doi.org/10.1021/ja00220a020
. [all data]
Amicangelo and Armentrout, 2001
Amicangelo, J.C.; Armentrout, P.B.,
Relative and Absolute Bond Dissociation Energies of Sodium Cation Complexes Determined Using Competitive Collision-Induced Dissociation Experiments,
Int. J. Mass Spectrom., 2001, 212, 1-3, 301, https://doi.org/10.1016/S1387-3806(01)00494-8
. [all data]
Armentrout and Rodgers, 2000
Armentrout, P.B.; Rodgers, M.T.,
An Absolute Sodium Cation Affinity Scale: Threshold Collision-Induced Dissociation Experiments and ab Initio Theory,
J. Phys. Chem A, 2000, 104, 11, 2238, https://doi.org/10.1021/jp991716n
. [all data]
Hoyau, Norrman, et al., 1999
Hoyau, S.; Norrman, K.; McMahon, T.B.; Ohanessian, G.,
A Quantitative Basis for a Scale of Na+ Affinities of Organic and Small Biological Molecules in the Gas Phase,
J. Am. Chem. Soc., 1999, 121, 38, 8864, https://doi.org/10.1021/ja9841198
. [all data]
Guo, Conklin, et al., 1989
Guo, B.C.; Conklin, B.J.; Castleman, A.W.,
Thermochemical Properties of Ion Complexes Na+(M)n in the Gas Phase,
J. Am. Chem. Soc., 1989, 111, 17, 6506, https://doi.org/10.1021/ja00199a005
. [all data]
McMahon and Ohanessian, 2000
McMahon, T.B.; Ohanessian, G.,
An Experimental and Ab Initio Study of the Nature of the Binding in Gas-Phase Complexes of Sodium Ions,
Chem. Eur. J., 2000, 6, 16, 2931, https://doi.org/10.1002/1521-3765(20000818)6:16<2931::AID-CHEM2931>3.0.CO;2-7
. [all data]
Guo and Castleman, 1990
Guo, B.C.; Castleman, A.W.,
The Association Reactions of Pb+ Ion with CH3OH and CH3NH2 in the Gas Phase,
Int. J. Mass Spectrom. Ion Proc., 1990, 100, 665, https://doi.org/10.1016/0168-1176(90)85101-7
. [all data]
Haken and Korhonen, 1985
Haken, J.K.; Korhonen, I.O.O.,
Gas chromatography of homologous esters. XXVII. Retention increments of C1-C18 primary alkanols and their 2-chloropropanoyl and 3-chloropropanoyl derivatives on SE-30 and OV-351 capillary columns,
J. Chromatogr., 1985, 319, 131-142, https://doi.org/10.1016/S0021-9673(01)90548-5
. [all data]
Winskowski, 1983
Winskowski, J.,
Gaschromatographische Identifizierung von Stoffen anhand von Indexziffem und unterschiedlichen Detektoren,
Chromatographia, 1983, 17, 3, 160-165, https://doi.org/10.1007/BF02271041
. [all data]
Haken, Nguyen, et al., 1979
Haken, J.K.; Nguyen, A.; Wainwright, M.S.,
Application of linear extrathermodynamic relationships to alcohols, aldehydes, ketones, amd ethoxy alcohols,
J. Chromatogr., 1979, 179, 1, 75-85, https://doi.org/10.1016/S0021-9673(00)80658-5
. [all data]
Bogoslovsky, Anvaer, et al., 1978
Bogoslovsky, Yu.N.; Anvaer, B.I.; Vigdergauz, M.S.,
Chromatographic constants in gas chromatography (in Russian), Standards Publ. House, Moscow, 1978, 192. [all data]
Pías and Gascó, 1975
Pías, J.B.; Gascó, L.,
GC Retention Data of Alcohols and Benzoyl Derivatives of Alcohols,
J. Chromatogr. - Chrom. Data, 1975, d14-d16. [all data]
Brown, Chapman, et al., 1968
Brown, I.; Chapman, I.L.; Nicholson, G.J.,
Gas chromatography of polar solutes in electron acceptor stationary phases,
Aust. J. Chem., 1968, 21, 5, 1125-1141, https://doi.org/10.1071/CH9681125
. [all data]
Viani, Müggler-Chavan, et al., 1965
Viani, R.; Müggler-Chavan, F.; Reymond, D.; Egli, R.H.,
196. Sur la composition de l'arôme de café,
Helv. Chim. Acta, 1965, 48, 195-196, 1809-1815, https://doi.org/10.1002/hlca.19650480743
. [all data]
Haagen-Smit Laboratory, 1997
Haagen-Smit Laboratory,
Procedure for the detailed hydrocarbon analysis of gasolines by single column high efficiency (capillary) column gas chromatography, SOP NO. MLD 118, Revision No. 1.1, California Environmental Protection Agency, Air Resources Board, El Monte, California, 1997, 22. [all data]
Anderson, Jurel, et al., 1973
Anderson, A.; Jurel, S.; Shymanska, M.; Golender, L.,
Gas-liquid chromatography of some aliphatic and heterocyclic mono- and pollyfunctional amines. VII. Retention indices of amines in some polar and unpolar stationary phases,
Latv. PSR Zinat. Akad. Vestis Kim. Ser., 1973, 1, 51-63. [all data]
Zarazir, Chovin, et al., 1970
Zarazir, D.; Chovin, P.; Guiochon, G.,
Identification of hydroxylic compounds and their derivatives by gas chromatography,
Chromatographia, 1970, 3, 4, 180-195, https://doi.org/10.1007/BF02269018
. [all data]
Bonastre and Grenier, 1968
Bonastre, J.; Grenier, P.,
Contribution à l'étude de la polarité des phases stationnaires en chromatographie gaz-liquide. III. Calcul des coefficients d'activité relatifs et des indices de rétention de quelques alcools aliphatiques,
Bull. Soc. Chim. Fr., 1968, 1, 118-125. [all data]
Shimadzu, 2003
Shimadzu,
Gas chromatography analysis of organic solvents using capillary columns (No. 2), 2003, retrieved from http://www.shimadzu.com/apps/form.cfm. [all data]
Shimoda and Shibamoto, 1990
Shimoda, M.; Shibamoto, T.,
Isolation and identification of headspace volatiles from brewed coffee with an on-column GC/MS method,
J. Agric. Food Chem., 1990, 38, 3, 802-804, https://doi.org/10.1021/jf00093a045
. [all data]
Kevei and Kozma, 1976
Kevei, E.; Kozma, E.,
Gaschromatographische Untersuchungsmethoden zur Aromaprüfung in gekochtem Schweinefleisch (M. semimembranosus),
Nahrung, 1976, 20, 3, 243-252, https://doi.org/10.1002/food.19760200303
. [all data]
Censullo, Jones, et al., 2003
Censullo, A.C.; Jones, D.R.; Wills, M.T.,
Speciation of the volatile organic compounds (VOCs) in solventborne aerosol coatings by solid phase microextraction-gas chromatography,
J. Coat. Technol., 2003, 75, 936, 47-53, https://doi.org/10.1007/BF02697922
. [all data]
Golovnya, Kuz'menko, et al., 2000
Golovnya, R.V.; Kuz'menko, T.e.; Samusenko, A.L.,
Method for prediction of the ability of analyte for self-association in pure liquid, Proceedings 23rd ISCC; CD-ROM, 2000, retrieved from http://www.richrom.com/assets/CD23PDF/a09.pdf. [all data]
Golovnya, Kuz'menko, et al., 2000, 2
Golovnya, R.V.; Kuz'menko, T.E.; Samusenko, A.L.,
Gas-chromatographic method of evaluation of n-alkanol ability for self-association in pure liquid,
Russ. Chem. Bull. (Engl. Transl.), 2000, 49, 2, 317-320, https://doi.org/10.1007/BF02494680
. [all data]
Bartelt, 1997
Bartelt, R.J.,
Calibration of a commercial solid-phase microextraction device for measuring headspace concentrations of organic volatiles,
Anal. Chem., 1997, 69, 3, 364-372, https://doi.org/10.1021/ac960820n
. [all data]
Peng, Ding, et al., 1988
Peng, C.T.; Ding, S.F.; Hua, R.L.; Yang, Z.C.,
Prediction of Retention Indexes I. Structure-Retention Index Relationship on Apolar Columns,
J. Chromatogr., 1988, 436, 137-172, https://doi.org/10.1016/S0021-9673(00)94575-8
. [all data]
Ott, Fay, et al., 1997
Ott, A.; Fay, L.B.; Chaintreau, A.,
Determination and origin of the aroma impact compounds of yogurt flavor,
J. Agric. Food Chem., 1997, 45, 3, 850-858, https://doi.org/10.1021/jf960508e
. [all data]
van den Dool and Kratz, 1963
van den Dool, H.; Kratz, P. Dec.,
A generalization of the retention index system including linear temperature programmed gas-liquid partition chromatography,
J. Chromatogr., 1963, 11, 463-471, https://doi.org/10.1016/S0021-9673(01)80947-X
. [all data]
Shimadzu, 2003, 2
Shimadzu,
Gas chromatography analysis of organic solvents using capillary columns (No. 3), 2003, retrieved from http://www.shimadzu.com/apps/form.cfm. [all data]
Vernon, 1971
Vernon, F.,
An investigation into hydrogen bonding in gas-liquid chromatography,
J. Chromatogr., 1971, 63, 249-257, https://doi.org/10.1016/S0021-9673(01)85637-5
. [all data]
Anderson, 1968
Anderson, D.G.,
USe of Kovats retention indices and response factors for the qualitative and quantitative analysis of coating solvents,
J. Paint Technol., 1968, 40, 527, 549-557. [all data]
Cremer and Nonn, 1964
Cremer, E.; Nonn, H.,
Kennzahlen zur Identifizierung chromatographisch getrennter Komponenten,
Monatsh. Chem., 1964, 3, 3, 910-921, https://doi.org/10.1007/BF00908804
. [all data]
Bramston-Cook, 2013
Bramston-Cook, R.,
Kovats indices for C2-C13 hydrocarbons and selected oxygenated/halocarbons with 100 % dimethylpolysiloxane columns, 2013, retrieved from http://lotusinstruments.com/monographs/List .... [all data]
Supelco, 2012
Supelco, CatalogNo. 24160-U,
Petrocol DH Columns. Catalog No. 24160-U, 2012, retrieved from http://www.sigmaaldrich.com/etc/medialib/docs/Supelco/Datasheet/1/w97949.Par.0001.File.tmp/w97949.pdf. [all data]
Leffingwell and Alford, 2005
Leffingwell, J.C.; Alford, E.D.,
Volatile constituents of Perique tobacco,
Electron. J. Environ. Agric. Food Chem., 2005, 4, 2, 899-915. [all data]
Zenkevich, 2005
Zenkevich, I.G.,
Experimentally measured retention indices., 2005. [all data]
Health Safety Executive, 2000
Health Safety Executive,
MDHS 96 Volatile organic compounds in air - Laboratory method using pumed solid sorbent tubes, solvent desorption and gas chromatography
in Methods for the Determination of Hazardous Substances (MDHS) guidance, Crown, Colegate, Norwich, 2000, 1-24, retrieved from http://www.hse.gov.uk/pubns/mdhs/pdfs/mdhs96.pdf. [all data]
Shoenmakers, Oomen, et al., 2000
Shoenmakers, P.J.; Oomen, J.L.M.M.; Blomberg, J.; Genuit, W.; van Velzen, G.,
Comparison of comprehensive two-dimensional gas chromatography and gas chromatography-mass spectrometry for the characterization of complex hydrocarbon mixtures,
J. Chromatogr. A, 2000, 892, 1-2, 29-46, https://doi.org/10.1016/S0021-9673(00)00744-5
. [all data]
Kotowska, Zalikowski, et al., 2012
Kotowska, U.; Zalikowski, M.; Isidorov, V.A.,
HS-SPME/GC-MS analysis of volatile and semi-volatile organic compounds emitted from municipal sewage sludge,
Environ. Monit. Asses., 2012, 184, 5, 2893-2907, https://doi.org/10.1007/s10661-011-2158-8
. [all data]
Chen and Feng, 2007
Chen, Y.; Feng, C.,
QSPR study on gas chromatography retention index of some organic pollutants,
Comput. Appl. Chem. (China), 2007, 24, 10, 1404-1408. [all data]
Kou, Zhang, et al., 2006
Kou, J.; Zhang, S.; Hu, Y.; Qiao, H.; Li, J.,
Stidy on the relationships between structures and gas chromatographic retention indices of alcohols,
Comput. Appl. Chem. (Chinese), 2006, 23, 7, 651-654. [all data]
Blunden, Aneja, et al., 2005
Blunden, J.; Aneja, V.P.; Lonneman, W.A.,
Characterization of non-methane volatile organic compounds at swine facilities in eastern North Carolina,
Atm. Environ., 2005, 39, 36, 6707-6718, https://doi.org/10.1016/j.atmosenv.2005.03.053
. [all data]
Fu and Wang, 2004
Fu, S.-P.; Wang, Y.-Q.,
Estimation and prediction of gas chromatographic retention indices of alcohols by molecular electronegativity-distance vector,
J. Chongqing Univ., 2004, 27, 6, 106-109. [all data]
Zenkevich, 2001
Zenkevich, I.G.,
Encyclopedia of Chromatography. Derivatization of Acids for GC Analysis, Marcel Dekker, Inc., New York - Basel, 2001, 221. [all data]
Zenkevich, 2001, 2
Zenkevich, I.G.,
Encyclopedia of Chromatography. Derivatization of Carbonyls for GC Analysis, MArcel Dekker, Inc., New York - Basel, 2001, 233. [all data]
Zenkevich, 1999
Zenkevich, I.G.,
New Application of the Retention Index Concept in Gas and High Performance Liquid Chromatography,
Fresenius' J. Anal. Chem., 1999, 365, 4, 305-309, https://doi.org/10.1007/s002160051491
. [all data]
Flanagan, Streete, et al., 1997
Flanagan, R.J.; Streete, P.J.; Ramsey, J.D.,
Volatile Substance Abuse, UNODC Technical Series, No 5, United Nations, Office on Drugs and Crime, Vienna International Centre, PO Box 500, A-1400 Vienna, Austria, 1997, 56, retrieved from http://www.odccp.org/pdf/technicalseries1997-01-011.pdf. [all data]
Zenkevich and Chupalov, 1996
Zenkevich, I.G.; Chupalov, A.A.,
New Possibilities of Chromato Mass Pectrometric Identification of Organic Compounds Using Increments of Gas Chromatographic Retention Indices of Molecular Structural Fragments,
Zh. Org. Khim. (Rus.), 1996, 32, 5, 656-666. [all data]
Zenkevich, Korolenko, et al., 1995
Zenkevich, I.G.; Korolenko, L.I.; Khralenkova, N.B.,
Desorption with solvent vapor as a method of sample preparation in the sorption preconcentration of organic-compounds from the air of a working area and from industrial-waste gases,
J. Appl. Chem. USSR (Engl. Transl.), 1995, 50, 10, 937-944. [all data]
Schuberth, 1994
Schuberth, J.,
Joint use of retention index and mass spectrum in postmortem tests for volatile organics by headspace capillary gas chromatography with ion-trap detection,
J. Chromatogr. A, 1994, 674, 1-2, 63-71, https://doi.org/10.1016/0021-9673(94)85217-0
. [all data]
Strete, Ruprah, et al., 1992
Strete, P.J.; Ruprah, M.; Ramsey, J.D.; Flanagan, R.J.,
Detection and identification of volatile substances by headspace capillary gas chromatography to aid the diagnosis of acute poisoning,
Analyst, 1992, 117, 7, 1111-1127, https://doi.org/10.1039/an9921701111
. [all data]
Weller and Wolf, 1989
Weller, J.-P.; Wolf, M.,
Massenspektroskopie und Headspace-GC,
Beitr. Gerichtl. Med., 1989, 47, 525-532. [all data]
Waggott and Davies, 1984
Waggott, A.; Davies, I.W.,
Identification of organic pollutants using linear temperature programmed retention indices (LTPRIs) - Part II, 1984, retrieved from http://dwi.defra.gov.uk/research/completed-research/reports/dwi0383.pdf. [all data]
Sun, Siepmann, et al., 2006
Sun, L.; Siepmann, J.I.; Klotz, W.L.; Schure, M.R.,
retention in gas-liquid chromatography with a polyethylene oxide stationary phase: molecular simulation and experiment,
J. Chromatogr. A, 2006, 1126, 1-2, 373-380, https://doi.org/10.1016/j.chroma.2006.05.084
. [all data]
Shimadzu, 2012
Shimadzu, Pharmaceutical Related,
Analysis of pharmaceutical residual solvent (observation of separation) (1) - GC, 2012, retrieved from www.shimadzu.ru/applications/Applicationspdf/GC/Pharma/Pharmaceutical residual solvents GC.pdf. [all data]
Chida, Sone, et al., 2004
Chida, M.; Sone, Y.; Tamura, H.,
Aroma characteristics of stored tobacco cut leaves analyzed by a high vacuum distillation and canister system,
J. Agric. Food Chem., 2004, 52, 26, 7918-7924, https://doi.org/10.1021/jf049223p
. [all data]
Shimadzu Corporation, 2003
Shimadzu Corporation,
Analysis of pharmaceutical residual solvent (observation of separation), 2003, retrieved from http://www.shimadzu.com.br/analitica/aplicacoes/book/pharm69.pdf. [all data]
Tanaka, Yamauchi, et al., 2003
Tanaka, T.; Yamauchi, T.; Katsumata, R.; Kiuchi, K.,
Comparison of volatile components in commercial Itohiki-Natto by solid phase microextraction and gas chromatography,
Nippon Shokuhin Kagaku Kogaku Kaishi, 2003, 50, 6, 278-285, https://doi.org/10.3136/nskkk.50.278
. [all data]
Suhardi, Suzuki, et al., 2002
Suhardi, S.; Suzuki, M.; Yoshida, K.; Muto, T.; Fujita, A.; Watanbe, N.,
Changes in the volatile compounds and in the chemical and physical properties of snake fruit (Salacca edulis Reinw) Cv. Pondoh during maturation,
J. Agric. Food Chem., 2002, 50, 26, 7627-7633, https://doi.org/10.1021/jf020620e
. [all data]
Duque, Bonilla, et al., 2001
Duque, C.; Bonilla, A.; Bautista, E.; Zea, S.,
Exudation of low molecular wight compounds (thiobismethane, methyl isocyanide, amd methyl isothiocyanate) as a possible chemical defense mechanism in the marine sponge Ircinia felix,
Biochem. Systematics Ecol., 2001, 29, 5, 459-467, https://doi.org/10.1016/S0305-1978(00)00081-8
. [all data]
Vinogradov, 2004
Vinogradov, B.A.,
Production, composition, properties and application of essential oils, 2004, retrieved from http://viness.narod.ru. [all data]
Peng, Yang, et al., 1991
Peng, C.T.; Yang, Z.C.; Ding, S.F.,
Prediction of rentention idexes. II. Structure-retention index relationship on polar columns,
J. Chromatogr., 1991, 586, 1, 85-112, https://doi.org/10.1016/0021-9673(91)80028-F
. [all data]
Ramsey and Flanagan, 1982
Ramsey, J.D.; Flanagan, R.J.,
Detection and Identification of Volatile Organic Compounds in Blood by Headspace Gas Chromatography as an Aid to the Diagnosis of Solvent Abuse,
J. Chromatogr., 1982, 240, 2, 423-444, https://doi.org/10.1016/S0021-9673(00)99622-5
. [all data]