5,7-Octadien-4-one, 2,6-dimethyl-, (E)-

Normal alkane RI, non-polar column, custom temperature program

Data compiled by: NIST Mass Spectrometry Data Center, William E. Wallace, director

Column type CapillaryCapillaryCapillaryCapillaryPacked
Active phase ZB-5ZB-5HP-5CP Sil 5 CBOV-101
Column length (m) 30.30.30.25.2.5
Carrier gas NitrogenNitrogenHeHeN2
Substrate     Chromosorb G 60-80mesh DMCS
Column diameter (mm) 0.250.250.25
Phase thickness (μm) 0.250.250.250.39
Program not specifiednot specified60C(5min) => 1C/min => 140C => 10C/min => 270C(5min)not specifiednot specified
I 1149.1149.1149.1135.1125.
ReferenceVazques, Aimar, et al., 2011Vazquez, Demmel, et al., 2011Singh, Singh, et al., 2003Weyerstahl, Marschall, et al., 1998Swigar and Silverstein, 1981
Comment MSDC-RI MSDC-RI MSDC-RI MSDC-RI MSDC-RI

Normal alkane RI, polar column, custom temperature program

Data compiled by: NIST Mass Spectrometry Data Center, William E. Wallace, director

Column type CapillaryCapillary
Active phase HP-Innowax FSCDB-Wax
Column length (m) 60.60.
Carrier gas HeN2
Substrate
Column diameter (mm) 0.25
Phase thickness (μm) 0.250.25
Program 60C(10min) => 4C/min => 220C(10min) => 1C/min => 240Cnot specified
I 1522.1501.
ReferenceViljoen, Subramoney, et al., 2005Weyerstahl, Marschall, et al., 1998
Comment MSDC-RI MSDC-RI

Kovats' RI, non-polar column, temperature ramp

View large format table.

Column type Active phase I Reference Comment
CapillarySE-301132.Juliani, Koroch, et al., 2002He, 4. K/min; Column length: 30. m; Column diameter: 0.25 mm; Tstart: 60. C; Tend: 240. C
CapillaryDB-51120.Senatore and de Feo, 199930. m/0.25 mm/0.33 μm, He, 40. C @ 5. min, 2. K/min, 260. C @ 20. min
CapillaryDB-51122.de Feo, Porta, et al., 199830. m/0.25 mm/0.25 μm, He, 40. C @ 5. min, 2. K/min, 250. C @ 20. min

Van Den Dool and Kratz RI, non-polar column, temperature ramp

View large format table.

Column type Active phase I Reference Comment
CapillaryDB-11136.Agnaniet, Makani, et al., 200530. m/0.25 mm/0.25 μm, N2, 5. K/min; Tstart: 50. C; Tend: 200. C
CapillaryDB-11120.de Feo, Urrunaga Soria, et al., 200530. m/0.25 mm/0.25 μm, He, 40. C @ 5. min, 2. K/min, 260. C @ 20. min
CapillaryHP-51146.Ngassapa, Runyoro, et al., 200330. m/0.25 mm/0.25 μm, He, 3. K/min; Tstart: 60. C; Tend: 280. C

Van Den Dool and Kratz RI, non-polar column, custom temperature program

View large format table.

Column type Active phase I Reference Comment
CapillarySE-521144.Lorenzo, Loayza, et al., 200225. m/0.32 mm/0.40 μm, H2; Program: 60 C (8 min) 3 C/min -> 180 C 20 C/min -> 250 C (10 min)
CapillaryDB-51146.Boulanger, Chassagne, et al., 199930. m/0.25 mm/0.25 μm, H2; Program: 40C(5min) => 2C/min => 220C => 5C/min => 250C(15min)
CapillaryDB-51149.Boulanger, Chassagne, et al., 199930. m/0.25 mm/0.25 μm, H2; Program: 40C(5min) => 2C/min => 220C => 5C/min => 250C(15min)

Normal alkane RI, non-polar column, temperature ramp

View large format table.

Column type Active phase I Reference Comment
CapillaryZB-51150.Vazques, Aimar, et al., 201130. m/0.25 mm/0.25 μm, Nitrogen, 40. C @ 5. min, 5. K/min; Tend: 200. C
CapillaryZB-51151.Vazquez, Demmel, et al., 201130. m/0.25 mm/0.25 μm, Nitrogen, 40. C @ 5. min, 5. K/min, 200. C @ 5. min
CapillaryDB-51126.Yousefzadi, Heidari, et al., 2011Nitrogen, 60. C @ 1. min, 4. K/min, 250. C @ 10. min; Column length: 30. m; Column diameter: 0.25 mm
CapillaryDB-11129.Meshkatalsadat, Safaei-Ghomi. J., et al., 201060. m/0.25 mm/0.25 μm, Nitrogen, 5. K/min; Tstart: 60. C; Tend: 250. C
CapillaryDB-51146.Morteza-Semnani, Saeedi, et al., 200730. m/0.25 mm/0.25 μm, Helium, 4. K/min; Tstart: 60. C; Tend: 220. C
CapillaryHP-11122.Senatore, Napolitano, et al., 200430. m/0.25 mm/0.33 μm, He, 40. C @ 5. min, 2. K/min, 260. C @ 20. min

References

Vazques, Aimar, et al., 2011
Vazques, A.M.; Aimar, M.L.; Demmel, G.I.; Criado, S.G.; Ruiz, G.M.; Cantero, J.J.; Rossi, L.I.; Velasco, M.I., Determination of volatile organic compounds of Tagetes argentina Cabrera (asteraceae) using HS-SPME analysis, Boletin Latinoamericano y del Caribe Plantas Medicinales y Aromaticas, 2011, 10, 5, 463-469. [all data]

Vazquez, Demmel, et al., 2011
Vazquez, A.M.; Demmel, G.I.; Criado, S.G.; Aimar, M.L.; Cantero, J.; Rossi, L.I.; Velasco, M.I., Phytochemistry of TAgetes minuta L. (Asteraceae) from Cordoba, Argentina: comparative study between essential oil and HS-SPME analyses, Boletin Latinoamericano y del Caribe Plantas Medicinales y Aromaticas, 2011, 10, 4, 351-362. [all data]

Singh, Singh, et al., 2003
Singh, G.; Singh, O.P.; de Lampasona, M.P.; Catalán, C.A.N., Studies on essential oils. Part 35: chemical and biocidal investigations on Tagetes erecta leaf volatile oil, Flavour Fragr. J., 2003, 18, 1, 62-65, https://doi.org/10.1002/ffj.1158 . [all data]

Weyerstahl, Marschall, et al., 1998
Weyerstahl, P.; Marschall, H.; Weirauch, M.; Thefeld, K.; Surburg, H., Constituents of commercial Labdanum oil, Flavour Fragr. J., 1998, 13, 5, 295-318, https://doi.org/10.1002/(SICI)1099-1026(1998090)13:5<295::AID-FFJ751>3.0.CO;2-I . [all data]

Swigar and Silverstein, 1981
Swigar, A.A.; Silverstein, R.M., Monoterpenes, Aldrich Chemical Company, Milwaukee, WI, USA, 1981, 130. [all data]