Barbituric acid

Condensed phase thermochemistry data

Data compiled as indicated in comments:
ALS - Hussein Y. Afeefy, Joel F. Liebman, and Stephen E. Stein
DH - Eugene S. Domalski and Elizabeth D. Hearing

Quantity Value Units Method Reference Comment
Δfsolid-634.7 ± 2.9kJ/molCcbSoldatova, Kabo, et al., 1990ALS
Quantity Value Units Method Reference Comment
Δcsolid-1511.1 ± 2.8kJ/molCcbSoldatova, Kabo, et al., 1990ALS
Δcsolid-1501.6kJ/molCcbLemoult, 1904ALS
Quantity Value Units Method Reference Comment
solid,1 bar157.3J/mol*KN/ASoldatova, Kabo, et al., 1990, 2DH
solid,1 bar157.6J/mol*KN/AKoshchenko, Ismailov, et al., 1985Extrapolated below 90 K.; DH

Constant pressure heat capacity of solid

Cp,solid (J/mol*K) Temperature (K) Reference Comment
141.1298.15Soldatova, Kabo, et al., 1990, 2T = 10 to 450 K. Cp(c) = 25.67 + 0.3361T + 3.382x10-4T2 - 5.64x10-7T3 J/mol*K (200 to 450 K).; DH
141.1298.15Koshchenko, Ismailov, et al., 1985T = 90 to 300 K.; DH

References

Soldatova, Kabo, et al., 1990
Soldatova, T.V.; Kabo, G.Ya.; Kozyro, A.A.; Frenkel, M.L., Thermodynamic properties and tautomerism of barbituric acid, Russ. J. Phys. Chem. (Engl. Transl.), 1990, 64, 177-180. [all data]

Lemoult, 1904
Lemoult, M.P., Remarques sur une serie recenie de determinations calorimetriques, Compt. Rend., 1904, 663-635. [all data]

Soldatova, Kabo, et al., 1990, 2
Soldatova, T.V.; Kabo, G.Ya.; Kozyro, A.A.; Frenkel, M.L., Thermodynamic properties and tautomerism of barbituric acid, Zhur. Fiz. Khim., 1990, 64(2), 336-343. [all data]

Koshchenko, Ismailov, et al., 1985
Koshchenko, V.I.; Ismailov, T.S.; Potekhin, V.M.; Razikov, K.Kh., Thermodynamic functions of barbituric acid, Zhur. Prikl. Khim. (Leningrad), 1985, 58, 445-456. [all data]