1,2,3,4,8-Pentachlorodibenzofuran

Phase change data

Data compiled by: William E. Acree, Jr., James S. Chickos

Enthalpy of sublimation

ΔsubH (kJ/mol) Temperature (K) Method Reference Comment
125.2 ± 2.0400.MELi, Shibata, et al., 2004Based on data from 388. - 413. K.

References

Li, Shibata, et al., 2004
Li, Xian-Wei; Shibata, Etsuro; Kasai, Eiki; Nakamura, Takashi, VAPOR PRESSURES AND ENTHALPIES OF SUBLIMATION OF 17 POLYCHLORINATED DIBENZO-p-DIOXINS AND FIVE POLYCHLORINATED DIBENZOFURANS, Environ Toxicol Chem, 2004, 23, 2, 348-808, https://doi.org/10.1897/03-193 . [all data]