1H-Cycloprop[e]azulen-7-ol, decahydro-1,1,7-trimethyl-4-methylene-, [1ar-(1aα,4aα,7β,7aβ,7bα)]-

Kovats' RI, non-polar column, custom temperature program

Data compiled by: NIST Mass Spectrometry Data Center, William E. Wallace, director

Column type CapillaryCapillaryCapillaryCapillaryCapillary
Active phase HP-5MSCP Sil 8 CBBP-1HP-5DB-5
Column length (m) 30.50.25.30.30.
Carrier gas HeHeN2HeHe
Substrate
Column diameter (mm) 0.250.320.250.250.25
Phase thickness (μm) 0.250.250.250.250.25
Program 50C(2min) => 2C/min => 160C(5min) => 50C/min => 270C (6min)60C(1min) => 3C/min => 70C => 15C/min => 170C(8min) => 5C/min => 250C60C => 5C/min => 220C(5min) => 3C/min => 245C(5min)40C(10min) => 3C/min => 200C => 2C/min => 220C35C => 4C/min => 180C => 20C/min => 280C
I 1574.1578.1564.1577.1554.
ReferenceMevy, Bousquet-Melou, et al., 2006Radusiene, Judzentiene, et al., 2005Dwivedi, Khan, et al., 2004Sibanda, Chigwada, et al., 2004Araújo, Silveira, et al., 2003
Comment MSDC-RI MSDC-RI MSDC-RI MSDC-RI MSDC-RI
Column type CapillaryCapillaryCapillaryCapillaryCapillary
Active phase BP-1BP-1DB-5HP-5DB-5
Column length (m) 25.30. 30.30.
Carrier gas N2N2 H2H2
Substrate
Column diameter (mm) 0.250.32 0.320.20
Phase thickness (μm) 0.250.25 0.25
Program 60C => 5C/min => 220C (5min) => 3C/min => 245 C (5min)60 C 5 C/min -> 220 C (5 min) 3 C/min -> 245 C (5 min)not specified60 0C (8 min) 3 K/min -> 180 0C 20 K/min (20 min)not specified
I 1563.1563.1576.1578.1576.
ReferenceKhan, Srivastava, et al., 2003Khan, Srivastava, et al., 2002Bizzo, Lopes, et al., 2001Frizzo, Serafini, et al., 2001Moreira, Sousa, et al., 2001
Comment MSDC-RI MSDC-RI MSDC-RI MSDC-RI MSDC-RI
Column type CapillaryCapillaryCapillaryCapillaryCapillary
Active phase AT-5DB-5MSAT-5DB-5DB-5
Column length (m) 60.30.60.30.30.
Carrier gas HeHeHe
Substrate
Column diameter (mm) 0.250.250.250.260.25
Phase thickness (μm) 0.250.250.250.250.25
Program 60 C 4K/min -> 200 C 10 K/min -> 280 C40C => 2C/min => 60C => 4C/min => 260C60 C (1 min) 4 K/min -> 200 C 10 K/min -> 280 Cnot specified50C(5min) => 2C/min => 250C (60min) => 2C/min => 270C => 1C/min => 290C
I 1576.1573.1594.1576.1556.
ReferenceKhouri, Usubillaga, et al., 2000Maia, Andrade, et al., 2000Rojas and Usubillaga, 2000Adams, 1998Roscigno, 1998
Comment MSDC-RI MSDC-RI MSDC-RI MSDC-RI MSDC-RI
Column type Capillary
Active phase DB-5
Column length (m) 30.
Carrier gas He
Substrate
Column diameter (mm) 0.25
Phase thickness (μm) 0.25
Program 40C => 2C/min => 60C => 4C/min => 240C
I 1573.
ReferenceSantos, Andrade, et al., 1998
Comment MSDC-RI

Normal alkane RI, non-polar column, custom temperature program

Data compiled by: NIST Mass Spectrometry Data Center, William E. Wallace, director

Column type CapillaryCapillaryCapillaryCapillaryCapillary
Active phase DB-5DB-1RTX-1VF-5VF-5
Column length (m) 30.30.60.30.30.
Carrier gas HeliumHydrogenHeliumHeliumHelium
Substrate
Column diameter (mm) 0.250.250.220.250.25
Phase thickness (μm) 0.250.250.250.250.25
Program not specified45 0C 3 0C/min -> 175 0C 15 0C/min -> 300 0C (10 min)not specified50 0C (2 min) 3 0C/min -> 200 0C (3 min) 10 0C/min -> 220 0C (8 min)not specified
I 1577.1551.1564.1581.1576.
ReferenceRodriques, Amorim, et al., 2013Albano, Lima, et al., 2012Bendiabdellah, El Amine Dib, et al., 2012Shivashankar, Roy, et al., 2012Shivashankar, Roy, et al., 2012
Comment MSDC-RI MSDC-RI MSDC-RI MSDC-RI MSDC-RI
Column type CapillaryCapillaryCapillaryCapillaryCapillary
Active phase Polydimethyl siloxane with 5 % Ph groupsHP-55 % Phenyl polydimethyl siloxaneHP-5 MSDB-1
Column length (m) 30.30. 30.30.
Carrier gas HeliumNitrogen HeliumHelium
Substrate
Column diameter (mm) 0.250.35 0.250.25
Phase thickness (μm) 0.250.25 0.250.25
Program 50 0C 4 0C/min -> 200 0C (5 min) 20 0C/min -> 280 0C60 0C 3 0C/min -> 210 0C 5 0C/min -> 250 0C (2 min)not specified60 0C (1 min) 10 0C -> 180 0C (1 min) 20 0C/min -> 280 0C (15 min)50 0C (5 min) 3 0C/min -> 240 0C 15 0C/min -> 300 0C (3 min)
I 1575.1581.1577.1578.1576.
Referenceda Silva, de Souza, et al., 2012Veres, Csupor-Loffler, et al., 2012Chaverri, Diaz, et al., 2011Chu, Liu, et al., 2011Fathi, Sahari, et al., 2011
Comment MSDC-RI MSDC-RI MSDC-RI MSDC-RI MSDC-RI
Column type CapillaryCapillaryCapillaryCapillaryCapillary
Active phase  HP-5ZB-5ZB-5HP-5 MS
Column length (m)  30.30.30.30.
Carrier gas  NitrogenNitrogenNitrogenHelium
Substrate
Column diameter (mm)  0.250.250.250.25
Phase thickness (μm)  0.250.250.250.25
Program not specified35 0C (10 min) 3 0C/min -> 205 0C 10 0C/min -> 225 0Cnot specifiednot specified50 0C (1.5 min) 10 0C/min -> 180 0C (2 min) 6 0C/min -> 280 0C (10 min)
I 1619.1575.1549.1549.1587.
ReferenceKarimi, Farmany, et al., 2011Laribi, Kouki, et al., 2011Vazques, Aimar, et al., 2011Vazquez, Demmel, et al., 2011Wang, Xu, et al., 2011
Comment MSDC-RI MSDC-RI MSDC-RI MSDC-RI MSDC-RI
Column type CapillaryCapillaryCapillaryCapillaryCapillary
Active phase HP-5 MSHP-5 MSDB-5DB-1DB-5
Column length (m) 30.30.30.30.30.
Carrier gas HeliumHeliumHeliumHeliumHelium
Substrate
Column diameter (mm) 0.250.250.250.250.25
Phase thickness (μm) 0.250.250.250.250.25
Program 60 0C (1 min) 10 0C/min -> 180 0C (1 min) 20 0C/min -> 280 0C (15 min)60 0C (1 min) 10 0C/min -> 180 0C (1 min) 20 0C/min -> 280 0C (15 min)not specifiednot specified50 0C m6 0C/min -> 140 0C 5 0C/min -> 160 0C (1 min) 10 0C/min -> 200 0C
I 1578.1578.1576.1572.1585.
ReferenceLiu, Chu, et al., 2010Liu, Chu, et al., 2010Scherer, Wagner, et al., 2010Xu, Tang, et al., 2010Courtois, Paine, et al., 2009
Comment MSDC-RI MSDC-RI MSDC-RI MSDC-RI MSDC-RI
Column type CapillaryCapillaryCapillaryCapillaryCapillary
Active phase HP-5HP-5HP-5HP-5HP-5
Column length (m) 25.25.25.25.25.
Carrier gas HeliumHeliumHeliumHeliumHelium
Substrate
Column diameter (mm) 0.320.320.320.320.32
Phase thickness (μm) 0.170.170.170.170.17
Program 60 0C (5 min) 4 0C/min -> 220 0C 11 0C/min -> 280 0C (15 min)60 0C (5 min) 4 0C/min -> 220 0C 11 0C/min -> 280 0C (15 min)60 0C (5 min) 4 0C/min -> 220 0C 11 0C/min -> 280 0C (15 min)not specifiednot specified
I 1572.1572.1579.1578.1578.
ReferenceCuster, 2009Custer, 2009Custer, 2009Custer, 2009Custer, 2009
Comment MSDC-RI MSDC-RI MSDC-RI MSDC-RI MSDC-RI
Column type CapillaryCapillaryCapillaryCapillaryCapillary
Active phase HP-5DB-1Optima-5MS5 % Phenyl methyl siloxaneRTX-5
Column length (m) 25.60.30.30.30.
Carrier gas HeliumHeliumHeliumHeliumNitrogen
Substrate
Column diameter (mm) 0.320.250.320.250.25
Phase thickness (μm) 0.170.250.250.250.25
Program not specified50 0C (5 min) 3 0C/min -> 120 0C 5 0C/min -> 250 0C (3 min) 15 0C/min -> 300 0C (20 min)40 0C (5 min) 5 0C/min -> 230 0C 30 0C/min -> 280 0C (5 min)50 0C (2 min) 10 0C/min -> 150 0C 15 0C/min -> 300 0C (10 min)60 0C 95 min) 110 0C 3 0C/min -> 200 0C 5 0C/min -> 220 0C 95 min)
I 1578.1583.1573.1605.1585.
ReferenceCuster, 2009Delort and Jaquier, 2009HEuskin, Godin, et al., 2009Huang, Qin, et al., 2009Leela, Vipin, et al., 2009
Comment MSDC-RI MSDC-RI MSDC-RI MSDC-RI MSDC-RI
Column type CapillaryCapillaryCapillaryCapillaryCapillary
Active phase RTX-5HP-5HP-5 MSDB-1DB-5
Column length (m) 30.25.30.30.30.
Carrier gas NitrogenHeliumHeliumHydrogenHelium
Substrate
Column diameter (mm) 0.250.320.250.250.25
Phase thickness (μm) 0.250.170.250.250.25
Program not specified60 0C (5 min) 4 0C/min -> 220 0C 11 0C/min -> 280 0C40 0C (5 min) 2 0C/min -> 270 0C -> 260 0C (20 min)45 0C 3 0C/min -> 175 0C 15 0C/min -> 300 0C (10 min)not specified
I 1578.1575.1578.1551.1586.
ReferenceLeela, Vipin, et al., 2009Maggi, Bilek, et al., 2009Mancini, Arnold, et al., 2009Mendes, Trindade, et al., 2009Porto, Decorti, et al., 2009
Comment MSDC-RI MSDC-RI MSDC-RI MSDC-RI MSDC-RI
Column type CapillaryCapillaryCapillaryCapillaryCapillary
Active phase DB-5HP-5OV-1HP-5 MSDB-5
Column length (m) 30.30.30.30.30.
Carrier gas Helium HeliumHeliumHydrogen
Substrate
Column diameter (mm) 0.250.320.250.250.25
Phase thickness (μm) 0.25  0.250.25
Program not specifiednot specified40 0C 2 0C/min -> 130 0C (5 min) 10 0C/min -> 230 0C (15 min)32 0C (1 min) 50 0C/min -> 115 0C 1.5 0C/min -> 145 0C 12 0C/min -> 240 0C (10 min)35 0C 4 0C/min -> 180 0C 17 0C/min -> 280 0C (10 min)
I 1619.1575.1552.1578.1578.
ReferencePorto, Decorti, et al., 2009Riahi, Pourbasheer, et al., 2009Yu, Li, et al., 2009Zellner, Amorim, et al., 2009de Albuquerque, Alves, et al., 2008
Comment MSDC-RI MSDC-RI MSDC-RI MSDC-RI MSDC-RI
Column type CapillaryCapillaryCapillaryCapillaryCapillary
Active phase DB-5SLB-5 MSSLB-5 MSCP Sil 8 CBSLB-5 MS
Column length (m) 25.30.30.50.30.
Carrier gas NitrogenHeliumHeliumHeliumHelium
Substrate
Column diameter (mm) 0.220.250.250.320.25
Phase thickness (μm) 0.250.250.250.250.25
Program not specified50 0C 3 0C/min -> 250 0C (1 min) 10 0C/min -> 300 0C (5 min)not specifiednot specifiednot specified
I 1619.1579.1577.1578.1576.
ReferenceChieng, Assim, et al., 2008Costa, De Fina, et al., 2008Costa, De Fina, et al., 2008Kupcinskiene, Stikliene, et al., 2008Lo Presti, Sciarrone, et al., 2008
Comment MSDC-RI MSDC-RI MSDC-RI MSDC-RI MSDC-RI
Column type CapillaryCapillaryCapillaryCapillaryCapillary
Active phase HP-5MSDB-1BPX-5DB-5 MSRTX-5
Column length (m) 30.30.7.530.30.
Carrier gas HeHeHelium Helium
Substrate
Column diameter (mm) 0.250.250.100.250.25
Phase thickness (μm) 0.250.2510.0.250.25
Program 40 0C (2 min) 3 0C/min -> 180 0C (2 min) 15 0C -> 280 0C45C => 3C/min => 175C => 15C/min => 300C (10min)not specified80 0C (1.5 min) 4 pC/min -> 180 0C 10 0C/min -> 300 0C (10 min)60 0C (5 min) 5 0C/min -> 110 0C 3 0C/min -> 220 0C (5 min)
I 1553.1551.1576.1581.1586.
ReferenceNing, Zheng, et al., 2008Nogueira, Marcelo-Curto, et al., 2008Shellie, 2008Silva, Doria, et al., 2008Zachariah, Leela, et al., 2008
Comment MSDC-RI MSDC-RI MSDC-RI MSDC-RI MSDC-RI
Column type CapillaryCapillaryCapillaryCapillaryCapillary
Active phase RTX-5HP-5MSHP-5HP-5MSBP-5
Column length (m) 30.30.30.30.30.
Carrier gas HeliumHe HeHe
Substrate
Column diameter (mm) 0.250.250.250.250.32
Phase thickness (μm) 0.250.250.250.250.25
Program not specified40C(10min) => 3C/min => 200C => 2C/min => 220C75C(4min) => 5C/min => 135C => 1C/min => 220C => 10C/min => 280C40C(5min) => 2C/min => 250C(15min) => 10C/min => 270C60C => 4C/min => 150C => 10C/min => 220C
I 1578.1577.1577.1577.1570.
ReferenceZachariah, Leela, et al., 2008Cole, Haber, et al., 2007Duschatzky, Almeida, et al., 2007Formisano, Mignola, et al., 2007Hashemi, Abolghasemi, et al., 2007
Comment MSDC-RI MSDC-RI MSDC-RI MSDC-RI MSDC-RI
Column type CapillaryCapillaryCapillaryCapillaryCapillary
Active phase DB-5 MSDB-1HP-5HP-5MSCP Sil 8 CB
Column length (m) 30.30. 30.30.
Carrier gas HeliumH2 HeHe
Substrate
Column diameter (mm) 0.250.25 0.250.25
Phase thickness (μm) 0.250.25 0.250.25
Program 60 0C 3 0C/min -> 210 0C 5 0C/min -> 250 0C45 0C 3 0C/min -> 175 0C 15 0C/min -> 300 0C (10 min)not specified40C(3min) => 8C/min => 160C => 15C/min => 300C (10min)50C(3min) => 3C/min => 100C => 2.7C/min => 140C => 2.4C/min => 180C => 6C/min => 250C
I 1576.1551.1577.1578.1576.
ReferenceHaznagy-Radnai, Szigle, et al., 2007Kamatou, Viljoen, et al., 2007Liolios, Laouer, et al., 2007Liu, Song, et al., 2007Meekijjaroenroj, Bessière, et al., 2007
Comment MSDC-RI MSDC-RI MSDC-RI MSDC-RI MSDC-RI
Column type CapillaryCapillaryCapillaryCapillaryCapillary
Active phase HP-1HP-5 MSHP-5MSCP Sil 8 CBHP-5
Column length (m) 30.30.30.50.30.
Carrier gas HeHeliumHeHeliumHelium
Substrate
Column diameter (mm) 0.20.250.250.320.25
Phase thickness (μm) 0.330.250.250.250.25
Program 60C(5min) => 3C/min => 180C => 20C/min => 280C(10min)40 0C (10 min) 3 0C/min -> 200 0C 2 0C/min -> 220 0C40C(10min) => 3C/min => 200C => 2C/min => 220C60 0C (2 min) 5 0C/min -> 160 0C (1 min) 10 0C/min -> 280 0C (3 min)not specified
I 1574.1577.1580.1578.1578.
ReferenceMerle, Verdeguer, et al., 2007Moriarity, Bansal, et al., 2007Moronkola, Ogunwande, et al., 2007Radusiene, Judzentiene, et al., 2007Ristic, Krivokuca-Dokic, et al., 2007
Comment MSDC-RI MSDC-RI MSDC-RI MSDC-RI MSDC-RI
Column type CapillaryCapillaryCapillaryCapillaryCapillary
Active phase DB-5HP-5 MSHP-5MSPolydimethyl siloxaneDB-5
Column length (m) 30.30.30. 30.
Carrier gas HydrogenHeliumHe He
Substrate
Column diameter (mm) 0.250.250.25 0.25
Phase thickness (μm) 0.25   0.25
Program 35 0C 4 0C/min -> 180 0C 17 0C/min -> 280 0C (10 min)40 0C (10 min) 3 oC/min -> 200 0C 2 0C/min -> 220 0C40C(10min) => 3C/min => 200C => 2C/min => 220Cnot specified35C => 4C/min => 180C => 10C/min => 250C
I 1578.1574.1577.1575.1579.
ReferenceSantos, Santiago, et al., 2007Setzer, Stokes, et al., 2007Takaku, Haber, et al., 2007Werka, Boehme, et al., 2007Albuquerque, Canuto, et al., 2006
Comment MSDC-RI MSDC-RI MSDC-RI MSDC-RI MSDC-RI
Column type CapillaryCapillaryCapillaryCapillaryCapillary
Active phase HP-5MSHP-5MSHP-5HP-5HP-5MS
Column length (m) 30.30.30.30.30.
Carrier gas HeHe  He
Substrate
Column diameter (mm) 0.250.250.250.250.25
Phase thickness (μm) 0.250.250.250.250.25
Program 50C(2min) => 6C/min => 200C => 10C/min => 270C(10min)40C(5min) => 2C/min => 250C(15min) => 10C/min => 270C>2.5C/min => 180C => 100C/min => 250C (7.3min)>2.5C/min => 180C => 100C/min => 250C (7.3min)50C(3min) => 3C/min => 150C(10min) => 10C/min => 250C
I 1557.1577.1566.1570.1620.
ReferenceDeng, Xu, et al., 2006Formisano C., Senatore F., et al., 2006Goodner, Mahattanatawee, et al., 2006Goodner, Mahattanatawee, et al., 2006Güllüce, Özer, et al., 2006
Comment MSDC-RI MSDC-RI MSDC-RI MSDC-RI MSDC-RI
Column type CapillaryCapillaryCapillaryCapillaryCapillary
Active phase CP Sil 8 CBHP-5DB-1CP Sil 8 CBSPB-5
Column length (m) 50.30.30.50.30.
Carrier gas HeHeliumHeHeHelium
Substrate
Column diameter (mm) 0.320.320.250.320.25
Phase thickness (μm) 0.250.25 0.250.10
Program 60C(2min) => 5C/min => 160C(1min) => 10C/min => 250C (5min)not specified35C => 4C/min => 180C => 10C/min => 250C60 0C (2 min) 5 0C/min -> 160 0C 10 0C/min -> 250 0C (5 min)40 0C (1 min) 10 0C/min -> 120 0C 0.5 0C/min -> 150 0C 20 0C/min -> 280 0C (5 min)
I 1578.1578.1578.1578.1576.
ReferenceJudzentiene and Buzelyte, 2006Kucuk, Gulec, et al., 2006de Lima, Maia, et al., 2006Mockute, Bernotiene, et al., 2006Navickiene, Morandim, et al., 2006
Comment MSDC-RI MSDC-RI MSDC-RI MSDC-RI MSDC-RI
Column type CapillaryCapillaryCapillaryCapillaryCapillary
Active phase DB-5HP-5 MSHP-5 MSHP-5 MSHP-5MS
Column length (m) 30.30.30.30.30.
Carrier gas HeHeliumHeliumHeliumHe
Substrate
Column diameter (mm) 0.250.250.250.250.25
Phase thickness (μm) 0.250.250.250.250.25
Program 35C => 4C/min => 180C => 10C/min => 250C40 0C (10 min) 3 0C/min -> 200 0C 2 0C/min -> 220 0C40 0C (10 min) 3 0C/min -> 200 0C 2 0C/min -> 220 0C40 0C (10 min) 3 0C/min -> 200 0C 2 0C/min -> 220 0C40C(5min) => 2C/min => 250C (15min) => 10C/min => 270C
I 1565.1577.1577.1577.1577.
ReferenceSantos, Nunes, et al., 2006Schmidt, Noletto, et al., 2006Schmidt, Noletto, et al., 2006Schmidt, Noletto, et al., 2006Senatore, Apostolides Arnold, et al., 2006
Comment MSDC-RI MSDC-RI MSDC-RI MSDC-RI MSDC-RI
Column type CapillaryCapillaryCapillaryCapillaryCapillary
Active phase HP-5MSSE-52DB-5MSDB-5MSCP Sil 8 CB
Column length (m) 30.30.30.30.50.
Carrier gas HeHeHe He
Substrate
Column diameter (mm) 0.250.320.250.250.32
Phase thickness (μm) 0.250.150.250.250.25
Program 60C => 1.5C/min => 185C(1min) => 9C/min => 275C(2min)45C => 1C/min => 100C => 5C/min => 250C (10min)60C => 3C/min => 180C => 250C (2min)70C(2min) => 10C/min => 150C(15min) => 5C/min => 240C50C(5min) => 2C/min => 90C => 15C/min => 240C(4min)
I 1579.1578.1574.1555.1578.
ReferenceSingh, Marimuthu, et al., 2006Tognolini, Barocelli, et al., 2006Tuberoso, Barra, et al., 2006Bagci and Baser, 2005Butkienë, Nivinskienë, et al., 2005
Comment MSDC-RI MSDC-RI MSDC-RI MSDC-RI MSDC-RI
Column type CapillaryCapillaryCapillaryCapillaryCapillary
Active phase DB-5DB-1DB-1BPX-5CP Sil 8 CB
Column length (m) 30.30.30.30.50.
Carrier gas HeHeHe He
Substrate
Column diameter (mm) 0.250.250.250.250.32
Phase thickness (μm) 0.250.250.250.250.25
Program 35C => 4C/min => 180C => 10C/min => 250C45C => 3C/min => 175C => 15C/min => 300C (10min)45C => 3C/min => 175C => 15C/min => 300C (10min)60C(0.2min) => 3K/min => 186C => 10C/min => 240C (5min)60C(1min) => 5C/min => 160C => 5C/min => 250C(3min)
I 1578.1551.1551.1576.1576.
ReferenceCysne, Canuto, et al., 2005Faleio, Miguel, et al., 2005Figueiredo, Sim-Sim, et al., 2005Judzentiene and Mockute, 2005Nivinskienë, Butkienë, et al., 2005
Comment MSDC-RI MSDC-RI MSDC-RI MSDC-RI MSDC-RI
Column type CapillaryCapillaryCapillaryCapillaryCapillary
Active phase HP-5MSPolydimethyl siloxane with 5 % Ph groupsCP Sil 8 CBDB-5DB-5
Column length (m) 30. 50.30.30.
Carrier gas   HeHeHe
Substrate
Column diameter (mm) 0.25 0.320.250.25
Phase thickness (μm) 0.25 0.250.10.25
Program 40C(5min) => 3C/min => 90C => 10C/min => 280Cnot specified60C(2min) => 5C/min => 160C(1min) => 10C/min => 250C (3min)35C => 4C/min => 180C => 10C/min => 250C35C => 4C/min => 180C => 10C/min => 280C
I 1565.1576.1578.1545.1576.
ReferenceNovak, Draxler, et al., 2005Pino, Marbot, et al., 2005Radudienë, Judpintienë, et al., 2005Albuquerque, Silveira, et al., 2004de Andrade, Bezerra, et al., 2004
Comment MSDC-RI MSDC-RI MSDC-RI MSDC-RI MSDC-RI
Column type CapillaryCapillaryCapillaryCapillaryCapillary
Active phase CP Sil 8 CBDB-1 OV-1CP Sil 8 CB
Column length (m) 50.30. 15.50.
Carrier gas HeHe HeHe
Substrate
Column diameter (mm) 0.320.25 0.3170.32
Phase thickness (μm) 0.25
Program 50C(5min) => 2C/min => 90C => 15C/min => 240C(4min)35C => 4C/min => 180C => 10C/min => 250Cnot specified50C(4min) => 4C/min => 90C => 10C/min => 300C(10min)60C(2min) => 5C/min => 160C (1min) => 10C/min => 250C (2min)
I 1578.1557.1561.1550.1576.
ReferenceButkienë, Nivinskienë, et al., 2004Cavalcanti, de Morais, et al., 2004El-Shazily, Hafez, et al., 2004El-Shazly and Hussein, 2004Judpentienë and Mockutë, 2004
Comment MSDC-RI MSDC-RI MSDC-RI MSDC-RI MSDC-RI
Column type CapillaryCapillaryCapillaryCapillaryCapillary
Active phase DB-1CP Sil 8 CBCP Sil 8 CBHP-5MSHP-5
Column length (m) 30.50.50.30.30.
Carrier gas HeHeHeHe
Substrate
Column diameter (mm) 0.250.320.320.250.25
Phase thickness (μm) 0.25 0.250.250.25
Program 45C => 3C/min => 175C => 15C/min => 300C (10min)50 0C (2 min) 3 0C/min -> 180 0C (1 min) 20 0C/min -> 250 0C (2 min)50C(2min) => 3C/min => 180C(1min) => 20C/min => 250C (2min)50C(3min) => 3C/min => 150C(10min) => 10C/min => 250C40C(5min) => 2C/min => 250C(15min) => 10C/min => 270C
I 1551.1576.1576.1578.1580.
ReferenceMiguel, Simões, et al., 2004Mockutë, Bernotienë, et al., 2004Mockutë, Judbentienë, et al., 2004Sahin, Gulluce, et al., 2004Senatore, Apostolides Arnold, et al., 2004
Comment MSDC-RI MSDC-RI MSDC-RI MSDC-RI MSDC-RI
Column type CapillaryCapillaryCapillaryCapillaryCapillary
Active phase DB-5SE-30CP-Sil 8CB-MSCP Sil 8 CBCP Sil 8 CB
Column length (m)   50.50.50.
Carrier gas    HeHe
Substrate
Column diameter (mm)   0.320.320.32
Phase thickness (μm)    0.250.25
Program not specifiednot specified60C(1min) => 3C/min => 70C => 15C/min => 170C(8min) => 5C/min => 250C70C(5min) => 3C/min => 100C (1min) => 25C/min => 250C (10min)60C(1min) => 5C/min => 160C => 10C/min => 250C(5min)
I 1576.1556.1576.1576.1576.
ReferenceVilaseca, Guy, et al., 2004Vinogradov, 2004Mockute, Bernotiene, et al., 2003Mockute and Judzentiene, 2003Mockute, Nivinskiene, et al., 2003
Comment MSDC-RI MSDC-RI MSDC-RI MSDC-RI MSDC-RI
Column type CapillaryCapillaryCapillaryCapillaryCapillary
Active phase DB-5CP Sil 8 CBCP Sil 8 CBDB-5CP Sil 8 CB
Column length (m) 30.50.50.
Carrier gas HeHeHe
Substrate
Column diameter (mm) 0.250.320.32
Phase thickness (μm) 0.25
Program 60C => 3C/min => 210C => 5C/min => 250C(2min)60C(2min) => 5C/min => 160C(1min) => 10C/min => 250C (2min)60C(2min) => 5C/min => 160C(1min) => 10C/min => 250C(2min)not specifiednot specified
I 1576.01576.1576.1578.1576.
ReferenceVeres, Varga, et al., 2003Mockute and Judzentiene, 2002Mockute and Judzentiene, 2002, 2Morteza-Semnani and Vahedi, 2002Schwob, Bessière, et al., 2002
Comment MSDC-RI MSDC-RI MSDC-RI MSDC-RI MSDC-RI
Column type CapillaryCapillaryCapillaryCapillaryCapillary
Active phase HP-5DB-5HP-5DB-5HP-5
Column length (m) 30.30.30. 30.
Carrier gas N2He  He
Substrate
Column diameter (mm) 0.320.250.25 0.25
Phase thickness (μm)  0.10.25 0.25
Program 60 C (5 min) 1 C/min -> 140 C 10 C/min -> 270 C (5 min)35C => 4C/min => 180C => 20C/min => 280Cnot specifiednot specified50 0C 3 K/min -> 200 0C 8 K/min -> 280 0C
I 1576.1576.1574.1562.1570.
ReferenceSingh, Singh, et al., 2002Viana, Andrade-Neto, et al., 2002Aparicio, Romero, et al., 2001Ferreira, Costantin, et al., 2001Usubillaga, Aparicio, et al., 2001
Comment MSDC-RI MSDC-RI MSDC-RI MSDC-RI MSDC-RI
Column type CapillaryCapillaryCapillaryCapillaryCapillary
Active phase CP Sil 5 CBCP Sil 5 CBDB-1OV-1CP Sil 5 CB
Column length (m) 25.25.30.50.25.
Carrier gas He HeHeN2
Substrate
Column diameter (mm) 0.390.390.250.32
Phase thickness (μm)   0.250.250.39
Program not specifiednot specified45C => 3C/min => 175C => 15C/min => 240C (10min)1)50C(1min) => 4C/min => 180C => 2C/min => 250C(10min) 2)50C(1min) => 6C/min => 200C => 12C/min => 250C(5min)not specified
I 1576.1570.1549.1567.1573.
ReferenceWeyerstahl, Marschall, et al., 1999Weyerstahl, Marschall, et al., 1999, 2Baratta, Dorman, et al., 1998Kökdil, 1998Weyerstahl, Marschall, et al., 1998
Comment MSDC-RI MSDC-RI MSDC-RI MSDC-RI MSDC-RI
Column type CapillaryCapillaryCapillaryCapillaryCapillary
Active phase CP Sil 5 CBDB-5DB-1CP Sil 5 CBCP Sil 5 CB
Column length (m) 25.30.30.25.25.
Carrier gas N2HeHeHeN2
Substrate
Column diameter (mm)  0.250.25
Phase thickness (μm)  0.250.25
Program not specified60C => 3C/min => 240C => 30C/min => 300C45C => 3C/min => 175C => 15C/min => 280Cnot specifiednot specified
I 1569.1572.1549.1567.1565.
ReferenceWeyerstahl, Marschall, et al., 1998, 2Yusuf, Begum, et al., 1998Gaspar, Palma, et al., 1997Weyerstahl, Marschall, et al., 1997Weyerstahl, Marschall, et al., 1997, 2
Comment MSDC-RI MSDC-RI MSDC-RI MSDC-RI MSDC-RI

Kovats' RI, non-polar column, temperature ramp

Data compiled by: NIST Mass Spectrometry Data Center, William E. Wallace, director

Column type CapillaryCapillaryCapillaryCapillaryCapillary
Active phase HP-5MSHP-5MSDB-5HP-1BP-1
Column length (m) 30.60.30.60.25.
Carrier gas HeHeHeHeN2
Substrate
Column diameter (mm) 0.250.250.250.250.32
Phase thickness (μm) 0.250.250.250.250.25
Tstart (C) 60.40.60.60.60.
Tend (C) 280.250. 200.220.
Heat rate (K/min) 2.3.3.4.5.
Initial hold (min) 8.1. 5.
Final hold (min) 30.20. 25.13.
I 1571.1605.1578.1584.1566.
ReferenceHazzit, Baaliouamer, et al., 2006Jalali-Heravi, Zekavat, et al., 2006Lucero, Fredrickson, et al., 2006Meccia G., Rosquete C., et al., 2006Raina, Verma, et al., 2006
Comment MSDC-RI MSDC-RI MSDC-RI MSDC-RI MSDC-RI
Column type CapillaryCapillaryCapillaryCapillaryCapillary
Active phase HP-5MSSPB-1HP-5MSBP-5DB-5MS
Column length (m) 30.30.30.50.30.
Carrier gas HeHeHeHeHe
Substrate
Column diameter (mm) 0.250.320.250.320.25
Phase thickness (μm) 0.250.250.250.250.25
Tstart (C) 50.60.50.50.60.
Tend (C) 240.240.250.260.240.
Heat rate (K/min) 3.4.3.5.3.
Initial hold (min)  4.10.2.
Final hold (min)  2.5.5.
I 1622.1574.1582.1585.1578.
ReferenceTepe, Askin Akpulat, et al., 2006Walde, Jyothirmayi, et al., 2006Asuming, Beauchamp, et al., 2005Baranauskiene, Venskutonis, et al., 2005Maia, Andrade, et al., 2005
Comment MSDC-RI MSDC-RI MSDC-RI MSDC-RI MSDC-RI
Column type CapillaryCapillaryCapillaryCapillaryCapillary
Active phase BPX-5HP-5MSDB-5DB-5CP Sil 8 CB
Column length (m) 25.30.30.30.30.
Carrier gas HeHeHeHeH2
Substrate
Column diameter (mm) 0.220.250.250.250.25
Phase thickness (μm) 0.250.250.250.250.25
Tstart (C) 60.60.60.60.50.
Tend (C) 240.200.220.300.220.
Heat rate (K/min) 3.4.4.5.3.
Initial hold (min)  1.4. 2.
Final hold (min)  15.
I 1566.1577.1576.1569.1574.
ReferenceEl-Ghorab, Mansour, et al., 2004Juliani, Zygadlo, et al., 2004Morteza-Semnani, Azadbakht, et al., 2004Santos, Lopes, et al., 2004Schwob, Bessiere, et al., 2004
Comment MSDC-RI MSDC-RI MSDC-RI MSDC-RI MSDC-RI
Column type CapillaryCapillaryCapillaryCapillaryCapillary
Active phase HP-5MSDB-1DB-5HP-5MSHP-5MS
Column length (m) 30.50.50.30.30.
Carrier gas HeN2HeHeHe
Substrate
Column diameter (mm) 0.320.250.320.250.25
Phase thickness (μm) 0.250.250.250.250.25
Tstart (C) 70.95.50.50.60.
Tend (C) 250.240.280.280.280.
Heat rate (K/min) 3.4.5.4.3.
Initial hold (min) 5. 2.2.
Final hold (min)   10.10.
I 1566.1566.1591.1585.1557.
ReferenceSiani, Garrido, et al., 2004Velasco-Negueruela, Sanz, et al., 2004Baranauskiene, Venskutonis, et al., 2003Baranauskiene, Venskutonis, et al., 2003, 2Gkinis, Tzakou, et al., 2003
Comment MSDC-RI MSDC-RI MSDC-RI MSDC-RI MSDC-RI
Column type CapillaryCapillaryCapillaryCapillaryCapillary
Active phase DB-5CP Sil 5 CBHP-5BP-1BP-1
Column length (m) 30.25.30.25.25.
Carrier gas HeH2HeN2N2
Substrate
Column diameter (mm) 0.250.250.250.320.55
Phase thickness (μm) 0.250.150.250.250.25
Tstart (C) 60.50.60.60.60.
Tend (C)  230.280.220.220.
Heat rate (K/min) 3.3.3.5.5.
Initial hold (min)
Final hold (min)    15.15.
I 1578.1573.1570.1554.1568.
ReferenceLucero, Estell, et al., 2003Ogunwande, Olawore, et al., 2003Özcan, Tzakou, et al., 2003Raina, Srivastava, et al., 2003Srivastava, Ahmad, et al., 2003
Comment MSDC-RI MSDC-RI MSDC-RI MSDC-RI MSDC-RI
Column type CapillaryCapillaryCapillaryCapillaryCapillary
Active phase DB-5DB-5DB-5SPB-1SE-30
Column length (m) 30.25.30.30.30.
Carrier gas HeHe HeHe
Substrate
Column diameter (mm) 0.250.220.250.320.25
Phase thickness (μm) 0.250.250.50.25
Tstart (C) 50.60.50.60.60.
Tend (C) 250.240.250.225.240.
Heat rate (K/min) 0.53.7.2.4.
Initial hold (min) 5. 3.2.
Final hold (min) 10. 10.5.
I 1578.1568.1571.31552.1576.
ReferenceViña and Murillo, 2003El-Ghorab, Fadel, et al., 2002El-Massry, El-Ghorab, et al., 2002Jayaprakasha, Rao, et al., 2002Juliani, Koroch, et al., 2002
Comment MSDC-RI MSDC-RI MSDC-RI MSDC-RI MSDC-RI
Column type CapillaryCapillaryCapillaryCapillaryCapillary
Active phase SE-30BP-1BP-1BP-1DB-5
Column length (m) 25.60.25.30.25.
Carrier gas HeN2N2N2He
Substrate
Column diameter (mm) 0.220.320.320.320.20
Phase thickness (μm) 0.250.250.250.250.25
Tstart (C) 70.60.60.60.50.
Tend (C) 220.220.220.220.240.
Heat rate (K/min) 4.5.5.5.5.
Initial hold (min)
Final hold (min)   15.13.
I 1577.1568.1564.1563.1576.
ReferencePalá-Paúl, Velasco-Negueruela, et al., 2002Raina, Lal, et al., 2002Raina, Srivastava, et al., 2002Shawl, Srivastava, et al., 2002Akrout, Chemli, et al., 2001
Comment MSDC-RI MSDC-RI MSDC-RI MSDC-RI MSDC-RI
Column type CapillaryCapillaryCapillaryCapillaryCapillary
Active phase PTE-5PTE-5BP-1DB-5BP-1
Column length (m) 60.60.25.30.25.
Carrier gas H2H2N2H2N2
Substrate
Column diameter (mm) 0.320.320.550.200.55
Phase thickness (μm) 0.390.390.25 0.25
Tstart (C) 60.60.60.60.60.
Tend (C) 285.285.220.240.220.
Heat rate (K/min) 4.34.35.3.5.
Initial hold (min)
Final hold (min)   15. 15.
I 1580.1580.1561.1570.1566.
ReferenceGudzic, Dordevic, et al., 2001Gudzic, Dordevic, et al., 2001Jain, Srivastava, et al., 2001Moreira, Sousa, et al., 2001Raina, Srivastava, et al., 2001
Comment MSDC-RI MSDC-RI MSDC-RI MSDC-RI MSDC-RI
Column type CapillaryCapillaryCapillaryCapillaryCapillary
Active phase DB-5SE-30PTE-5HP-5MSCP Sil 5 CB
Column length (m) 30.25.60.30.25.
Carrier gas HeHeH2HeHe
Substrate
Column diameter (mm) 0.260.220.320.250.25
Phase thickness (μm) 0.250.250.30.25
Tstart (C) 60.70.60.60.60.
Tend (C) 240.220.285.280.280.
Heat rate (K/min) 3.5.4.33.5.
Initial hold (min)
Final hold (min)
I 1576.1561.1576.1576.1564.
ReferenceAdams, 2000Kardali, Velasco-Negueruela, et al., 2000Mitic and Dordevic, 2000Roussis, Tsoukatou, et al., 2000Kaul, Gujral, et al., 1999
Comment MSDC-RI MSDC-RI MSDC-RI MSDC-RI MSDC-RI
Column type CapillaryCapillaryCapillaryCapillaryCapillary
Active phase OV-101DB-5HP-5MSDB-5DB-5
Column length (m) 25.30.30.30.30.
Carrier gas  HeHeHeHe
Substrate
Column diameter (mm) 0.320.250.320.250.25
Phase thickness (μm)  0.330.250.250.25
Tstart (C) 50.40.70.60.60.
Tend (C) 200.260.250.240.240.
Heat rate (K/min) 5.2.3.3.4.
Initial hold (min)  5.5.
Final hold (min)  20.
I 1574.1564.1571.1580.1581.
ReferenceKuiate, Zollo, et al., 1999Senatore and de Feo, 1999Siani, Ramos, et al., 1999da Silva, Andrade, et al., 1999da Silva, Zoghbi, et al., 1999
Comment MSDC-RI MSDC-RI MSDC-RI MSDC-RI MSDC-RI
Column type CapillaryCapillaryCapillaryCapillaryCapillary
Active phase BP-1BP-1DB-5DB-5DB-5
Column length (m) 50.50.30.30.30.
Carrier gas   HeHeHe
Substrate
Column diameter (mm) 0.250.250.250.250.25
Phase thickness (μm) 0.250.250.250.250.25
Tstart (C) 60.60.40.40.40.
Tend (C) 260.260.250.250.250.
Heat rate (K/min) 2.2.2.2.2.
Initial hold (min)   5.5.5.
Final hold (min)   20.20.20.
I 1564.1566.1565.1564.1564.
ReferenceVera and Chane-Ming, 1999Vera and Chane-Ming, 1999de Feo, Porta, et al., 1998Senatore, Urrunaga Soria, et al., 1998Senatore, 1998
Comment MSDC-RI MSDC-RI MSDC-RI MSDC-RI MSDC-RI
Column type CapillaryCapillaryCapillaryCapillaryCapillary
Active phase BPX-5DB-5DB-5OV-1SE-30
Column length (m) 50.30.30.30.25.
Carrier gas N2HeHeHeN2
Substrate
Column diameter (mm) 0.220.250.250.310.2
Phase thickness (μm) 0.250.250.253.
Tstart (C) 60.40.60.70.60.
Tend (C) 185.250.240.280.180.
Heat rate (K/min) 2.2.3.10.3.
Initial hold (min) 10.5.  10.
Final hold (min)  20.  1.
I 1576.1565.1576.1575.1569.
ReferenceFournier, Hadjiakhoondi, et al., 1997Senatore, Urrunaga Soria, et al., 1997Tellez, Estell, et al., 1997Afsharypuor, Asgary, et al., 1996Jantan, Ali, et al., 1995
Comment MSDC-RI MSDC-RI MSDC-RI MSDC-RI MSDC-RI
Column type CapillaryCapillaryCapillaryCapillaryCapillary
Active phase DB-5DB-5DB-5OV-101SPB-1
Column length (m) 30.30.30.25.50.
Carrier gas    N2He
Substrate
Column diameter (mm)    0.250.20
Phase thickness (μm)
Tstart (C) 40.40.40.50.35.
Tend (C) 210.210.210.200.200.
Heat rate (K/min) 2.2.2.5.3.
Initial hold (min) 2.2.2. 5.
Final hold (min) 120.120.120. 20.
I 1571.1572.1570.1572.1565.
ReferenceLoayza, Abujder, et al., 1995Loayza, Abujder, et al., 1995Loayza, Abujder, et al., 1995Menut, Molangui, et al., 1995Wong and Tie, 1993
Comment MSDC-RI MSDC-RI MSDC-RI MSDC-RI MSDC-RI

Van Den Dool and Kratz RI, polar column, temperature ramp

Data compiled by: NIST Mass Spectrometry Data Center, William E. Wallace, director

Column type CapillaryCapillaryCapillaryCapillaryCapillary
Active phase BP-20BP-20HP-InnowaxBP-20RTX-Wax
Column length (m) 50.50.30.50.60.
Carrier gas HeHeHeHeHe
Substrate
Column diameter (mm) 0.220.220.250.220.22
Phase thickness (μm) 0.250.250.250.250.25
Tstart (C) 60.60.60.60.60.
Tend (C) 220.220.280.220.230.
Heat rate (K/min) 2.2.3.2.2.
Initial hold (min)
Final hold (min) 20.20. 20.35.
I 2120.2133.2140.2132.2103.
ReferenceBoti, Koukoua, et al., 2007Castilho, Liu, et al., 2007Kundakovic, Fokialakis, et al., 2007Lesueur, de Rocca Serra, et al., 2007Paolini J., Costa J., et al., 2007
Comment MSDC-RI MSDC-RI MSDC-RI MSDC-RI MSDC-RI
Column type CapillaryCapillaryCapillaryCapillaryCapillary
Active phase RTX-WaxHP-InnowaxPolyethylene GlycolHP-WaxBP-20
Column length (m) 60.30.30.30.50.
Carrier gas HeHeN2N2He
Substrate
Column diameter (mm) 0.220.250.320.250.22
Phase thickness (μm) 0.250.50.250.250.25
Tstart (C) 60.60.50.60.60.
Tend (C) 230.260.230.220.220.
Heat rate (K/min) 2.3.2.5.2.
Initial hold (min)   10.10.
Final hold (min) 35. 15. 20.
I 2103.2121.2138.2136.2124.
ReferencePaolini, Muselli, et al., 2007Saroglou, Marin, et al., 2007Dob, Dahmane, et al., 2006Flamini, Tebano, et al., 2006Gonny, Cavaleiro, et al., 2006
Comment MSDC-RI MSDC-RI MSDC-RI MSDC-RI MSDC-RI
Column type CapillaryCapillaryCapillaryCapillaryCapillary
Active phase DB-WaxSupelcowax-10DB-WaxInnowaxRTX-Wax
Column length (m) 60.30.60.50.60.
Carrier gas HeHeN2HeHe
Substrate
Column diameter (mm) 0.320.20.250.250.22
Phase thickness (μm) 0.250.20.250.250.25
Tstart (C) 35.70.70.50.60.
Tend (C) 220.220.230.220.230.
Heat rate (K/min) 3.3.2.2.2.
Initial hold (min)   2.3.
Final hold (min)  15.20.20.35.
I 2131.2113.2133.2127.2103.
ReferencePala-Paul, Copeland, et al., 2006Pinto, Pina-Vaz, et al., 2006Choi, 2005Lee, Lee, et al., 2005Paolini, Costa, et al., 2005
Comment MSDC-RI MSDC-RI MSDC-RI MSDC-RI MSDC-RI
Column type CapillaryCapillaryCapillaryCapillaryCapillary
Active phase BP-20DB-WaxDB-WaxSupelcowax-10HP-Wax
Column length (m) 50.30.60.30.30.
Carrier gas HeN2HeHeN2
Substrate
Column diameter (mm) 0.220.250.320.20.25
Phase thickness (μm) 0.250.250.250.20.25
Tstart (C) 60.60.32.70.60.
Tend (C) 230.220.220.220.240.
Heat rate (K/min) 2.5.3.3.3.
Initial hold (min)  10.
Final hold (min) 35.  15.
I 2124.2151.2132.2113.2106.
ReferenceVellutini, Baldovini, et al., 2005Bertoli, Menichini, et al., 2004Brophy, Goldsack, et al., 2004Cavaleiro, Salgueiro, et al., 2004Flamini, Cioni, et al., 2004
Comment MSDC-RI MSDC-RI MSDC-RI MSDC-RI MSDC-RI
Column type CapillaryCapillaryCapillaryCapillaryCapillary
Active phase HP-WaxHP-InnowaxDB-WaxHP-WaxDB-Wax
Column length (m) 30.30.30.30.60.
Carrier gas N2HeHeN2N2
Substrate
Column diameter (mm) 0.250.250.250.250.25
Phase thickness (μm) 0.250.50.250.250.25
Tstart (C) 60.60.40.60.70.
Tend (C) 220.260.200.220.230.
Heat rate (K/min) 5.3.4.5.2.
Initial hold (min) 10. 5.10.2.
Final hold (min)   20. 20.
I 2133.2135.2106.2133.2129.
ReferenceFlamini, Luigi Cioni, et al., 2004Grujic-Jovanovic, Skaltsa, et al., 2004Yu, Kim, et al., 2004Bader, Caponi, et al., 2003Choi, 2003
Comment MSDC-RI MSDC-RI MSDC-RI MSDC-RI MSDC-RI
Column type CapillaryCapillaryCapillaryCapillaryCapillary
Active phase RTX-WaxHP-InnowaxHP-InnowaxRTX-WaxBP-20
Column length (m) 30.30.30.30.50.
Carrier gas HeHeHeHe
Substrate
Column diameter (mm) 0.250.250.250.250.22
Phase thickness (μm) 0.250.50.50.250.25
Tstart (C) 45.60.60.45.60.
Tend (C) 250.260.260.250.220.
Heat rate (K/min) 3.3.3.3.2.
Initial hold (min) 6.  6.
Final hold (min)    10.20.
I 2092.2121.2151.2089.2113.
ReferenceShellie, Marriott, et al., 2003Skaltsa, Demetzos, et al., 2003Tzakou, Couladis, et al., 2003Mondello, Zappia, et al., 2002Pintore, Usai, et al., 2002
Comment MSDC-RI MSDC-RI MSDC-RI MSDC-RI MSDC-RI
Column type CapillaryCapillaryCapillaryCapillaryCapillary
Active phase HP-InnowaxHP-InnowaxBP-20DB-WaxDB-Wax
Column length (m) 30.30.50.60.60.
Carrier gas HeHeHeHeHe
Substrate
Column diameter (mm) 0.250.250.220.500.53
Phase thickness (μm) 0.500.500.251.01.0
Tstart (C) 60.60.60.60.50.
Tend (C) 260.260.220.225.220.
Heat rate (K/min) 3.3.2.3.3.
Initial hold (min)
Final hold (min) 10.
I 2149.2151.2115.2136.2136.
ReferenceCouladis, Baziou, et al., 2001Couladis, Tzakou, et al., 2001Lota, Serra, et al., 2001Brophy, Goldsack, et al., 2000Brophy, Goldsack, et al., 2000, 2
Comment MSDC-RI MSDC-RI MSDC-RI MSDC-RI MSDC-RI
Column type CapillaryCapillaryCapillaryCapillaryCapillary
Active phase DB-WaxCP-Wax 52CBDB-WaxDB-WaxDB-Wax
Column length (m) 60.25.60.30.60.
Carrier gas He N2HeHe
Substrate
Column diameter (mm) 0.530.250.250.250.53
Phase thickness (μm) 1.00.150.250.25
Tstart (C) 50.40.70.40.50.
Tend (C) 220.220.230.200.220.
Heat rate (K/min) 3.3.2.2.3.
Initial hold (min)  5.2.5.
Final hold (min)   20.20.
I 2136.2097.2121.2109.2136.
ReferenceBrophy, Goldsack, et al., 2000, 3Chagonda, Makanda, et al., 2000Choi and Sawamura, 2000Kim, Thuy, et al., 2000Brophy, Goldsack, et al., 1999
Comment MSDC-RI MSDC-RI MSDC-RI MSDC-RI MSDC-RI
Column type CapillaryCapillaryCapillaryCapillaryCapillary
Active phase DB-WaxCarbowax 20MDB-WaxSP-1000DB-Wax
Column length (m) 60.25.60.85.60.
Carrier gas HeH2HeHeHe
Substrate
Column diameter (mm) 0.530.250.320.50.32
Phase thickness (μm)  0.3
Tstart (C) 50.50.35.60.65.
Tend (C) 220.200.220.225.225.
Heat rate (K/min) 3.3.3.3.3.
Initial hold (min)  1.
Final hold (min)  20.
I 2136.2130.2132.2136.2136.
ReferenceBrophy, Goldsack, et al., 1999, 2Bicchi, Rubiolo, et al., 1998Brophy, Forster, et al., 1998Brophy, Forster, et al., 1998, 2Brophy, Goldsack, et al., 1998
Comment MSDC-RI MSDC-RI MSDC-RI MSDC-RI MSDC-RI
Column type CapillaryCapillaryCapillaryCapillaryCapillary
Active phase DB-WaxCarbowax 20MDB-WaxSP-1000BP-20
Column length (m) 60.25.60.85.50.
Carrier gas He HeHeHe
Substrate
Column diameter (mm) 0.320.250.320.50.22
Phase thickness (μm)  0.3  0.25
Tstart (C) 35.50.65.65.60.
Tend (C) 220.200.225.225.230.
Heat rate (K/min) 3.3.3.3.2.
Initial hold (min)  1.
Final hold (min)  20.  35.
I 2136.2130.2136.2136.2114.
ReferenceBrophy, Goldsack, et al., 1998, 2Bicchi, Fresia, et al., 1997Brophy, Goldsack, et al., 1997Brophy, Goldsack, et al., 1997, 2Mariotti, Costa, et al., 1997
Comment MSDC-RI MSDC-RI MSDC-RI MSDC-RI MSDC-RI
Column type CapillaryCapillaryCapillaryCapillary
Active phase BP-20CP-Wax 52CBCarbowax 20MDB-Wax
Column length (m) 50.50.50.30.
Carrier gas HeH2HeHe
Substrate
Column diameter (mm) 0.220.230.20.32
Phase thickness (μm) 0.250.120.20.5
Tstart (C) 60.50.30.40.
Tend (C) 230.200.170.220.
Heat rate (K/min) 2.1.54.3.
Initial hold (min)  10.2.
Final hold (min) 35.10.20.
I 2119.2145.2103.2121.
ReferenceMariotti, Tomi, et al., 1997Chyau, Mau, et al., 1996Píry, Príbela, et al., 1995Le Quere and Latrasse, 1990
Comment MSDC-RI MSDC-RI MSDC-RI MSDC-RI

References

Mevy, Bousquet-Melou, et al., 2006
Mevy, J.P.; Bousquet-Melou, A.; Greff, S.; Millogo, J.; Fernandez, C., Chemical composition of the volatile oil of Laggera aurita Schulz from Burkina-Faso, Biochem. Syst. Ecol., 2006, 34, 11, 815-818, https://doi.org/10.1016/j.bse.2006.06.005 . [all data]

Radusiene, Judzentiene, et al., 2005
Radusiene, J.; Judzentiene, A.; Bernotiene, G., Essential oil composition and variability of Hypericum perforatum L. growing in Lithuania, Biochem. Syst. Ecol., 2005, 33, 2, 113-124, https://doi.org/10.1016/j.bse.2004.06.010 . [all data]

Dwivedi, Khan, et al., 2004
Dwivedi, S.; Khan, M.; Srivastava, S.K.; Syamasunnder, K.V.; Srivastava, A., Essential oil composition of different accessions of Mentha × piperita L. grown on the northern plains of India, Flavour Fragr. J., 2004, 19, 5, 437-440, https://doi.org/10.1002/ffj.1333 . [all data]

Sibanda, Chigwada, et al., 2004
Sibanda, S.; Chigwada, G.; Poole, M.; Gwebu, E.T.; Noletto, J.A.; Schmidt, J.M.; Rea, A.I.; Setzer, W.N., Composition and bioactivity of the leaf essential oil of Heteropyxis dehniae from Zimbabwe, J. Ethnopharmacol., 2004, 92, 1, 107-111, https://doi.org/10.1016/j.jep.2004.02.010 . [all data]

Araújo, Silveira, et al., 2003
Araújo, E.C.C.; Silveira, E.R.; Lima, M.A.S.; Neto, M.A.; de Andrade, I.L.; Lima, M.A.A.; Santiago, G.M.P.; Mesquita, A.L.M., Insecticidal activity and chemical composition of volatile oils from Hyptis martiusii Benth, J. Agric. Food Chem., 2003, 51, 13, 3760-3762, https://doi.org/10.1021/jf021074s . [all data]

Khan, Srivastava, et al., 2003
Khan, M.; Srivastava, S.K.; Jain, N.; Syamasundar, K.V.; Yadav, A.K., Chemical composition of fruit and stem essential oils of Lantana camara from northern India, Flavour Fragr. J., 2003, 18, 5, 376-379, https://doi.org/10.1002/ffj.1197 . [all data]

Khan, Srivastava, et al., 2002
Khan, M.; Srivastava, S.K.; Syamasundar, K.V.; Singh, M.; Naqvi, A.A., Chemical composition of leaf and flower essential oil of Lantana camara from India, Flavour Fragr. J., 2002, 17, 1, 75-77, https://doi.org/10.1002/ffj.1047 . [all data]

Bizzo, Lopes, et al., 2001
Bizzo, H.R.; Lopes, D.; Abdala, R.V.; Pimentel, F.A.; de Souza, J.A.; Pereira, M.V.G.; Bergter, L.; Guimaraes, E.F., Sarisan from leaves of Piper affinis hispidinervum C. DC (long pepper), Flavour Fragr. J., 2001, 16, 2, 113-115, https://doi.org/10.1002/ffj.957 . [all data]

Frizzo, Serafini, et al., 2001
Frizzo, C.D.; Serafini, L.A.; Dellacassa, E.; Lorenzo, D.; Moyna, P., Essential oil of Baccharis uncinella DC. from Southern Brazil, Flavour Fragr. J., 2001, 16, 4, 286-288, https://doi.org/10.1002/ffj.998 . [all data]

Moreira, Sousa, et al., 2001
Moreira, D.L.; Sousa, P.O.; Pereira, N.A.; Cardoso, G.L., Effect of leaf essential oil from Piper solmsianum C.DC. in mice behaviour, An. Acad. Bras. Cienc., 2001, 73, 1, 1-7, https://doi.org/10.1590/S0001-37652001000100004 . [all data]

Khouri, Usubillaga, et al., 2000
Khouri, N.; Usubillaga, A.; Rojas, L.B.; Galarraga, F., The essential oil of Espeletia weddellii Sch. Bip. ex Wedd., Flavour Fragr. J., 2000, 15, 4, 263-265, https://doi.org/10.1002/1099-1026(200007/08)15:4<263::AID-FFJ907>3.0.CO;2-Q . [all data]

Maia, Andrade, et al., 2000
Maia, J.G.S.; Andrade, E.H.A.; Zoghbi, M.G.B., Volatile constituents of the leaves, fruits and flowers of cashew ( Anacardium occidentaleL.), J. Food Comp. Anal., 2000, 13, 3, 227-232, https://doi.org/10.1006/jfca.2000.0894 . [all data]

Rojas and Usubillaga, 2000
Rojas, L.B.; Usubillaga, A., Composition of the essential oil fo Satureja brownei (SW.) Briq. from Venezuela, Flavour Fragr. J., 2000, 15, 1, 21-22, https://doi.org/10.1002/(SICI)1099-1026(200001/02)15:1<21::AID-FFJ861>3.0.CO;2-G . [all data]

Adams, 1998
Adams, R.P., The essential oils and chemotaxonomy of Juniperus sect. Juniperus, Biochem. Syst. Ecol., 1998, 26, 6, 637-645, https://doi.org/10.1016/S0305-1978(98)00020-9 . [all data]

Roscigno, 1998
Roscigno, G., Estrazione supercritica di principi farmaceutici e biopesticidi, Tesi di Laurea, Universita degli Studi di Salerno, Salerno, Italy, 1998, 121. [all data]

Santos, Andrade, et al., 1998
Santos, A.S.; Andrade, E.H.A.; Zoghbi, M.G.B.; Maia, J.G.S., Volatile constituents of fruits of Annona glabra L. from Brazil, Flavour Fragr. J., 1998, 13, 3, 148-150, https://doi.org/10.1002/(SICI)1099-1026(199805/06)13:3<148::AID-FFJ711>3.0.CO;2-Y . [all data]