2,4-Nonadienal

Normal alkane RI, non-polar column, temperature ramp

Data compiled by: NIST Mass Spectrometry Data Center, William E. Wallace, director

Column type CapillaryCapillaryCapillaryCapillaryCapillary
Active phase HP-5 MSHP-5DB-5DB-5DB-5
Column length (m) 30.30.60.60.13.5
Carrier gas HeliumNitrogenHeHeHe
Substrate
Column diameter (mm) 0.250.250.320.320.32
Phase thickness (μm) 0.250.25
Tstart (C) 50.50.60.50.35.
Tend (C) 250.280.250.250.225.
Heat rate (K/min) 5.5.4.4.6.
Initial hold (min) 0.51.5.5.3.
Final hold (min) 0.51.
I 1212.1210.1208.1215.1214.
ReferenceFanaro, Duarte, et al., 2012Saidana, Mahjoub, et al., 2008Fadel, Mageed, et al., 2006Fadel, Mageed, et al., 2006, 2de Souza, Vásquez, et al., 2006
Comment MSDC-RI MSDC-RI MSDC-RI MSDC-RI MSDC-RI
Column type CapillaryCapillaryCapillaryCapillaryPacked
Active phase HP-5SE-54SE-54HG-5SE-54
Column length (m) 50.30.30.50.3.
Carrier gas    He
Substrate     Chromosorb G AW DMCS (100-120 mesh)
Column diameter (mm) 0.320.520.520.32
Phase thickness (μm) 0.521.51.50.52
Tstart (C) 35.5.5.35.50.
Tend (C) 250.230.230.250.230.
Heat rate (K/min) 2.6.6.3.6.
Initial hold (min) 15.  15.2.
Final hold (min) 45.  45.10.
I 1218.1195.1193.1219.1192.
ReferenceBoylston and Viniyard, 1998Milo and Grosch, 1996Milo and Grosch, 1996Drumm and Spanier, 1991Schieberle, 1991
Comment MSDC-RI MSDC-RI MSDC-RI MSDC-RI MSDC-RI

Normal alkane RI, polar column, custom temperature program

Data compiled by: NIST Mass Spectrometry Data Center, William E. Wallace, director

Column type Capillary
Active phase DB-Wax
Column length (m) 60.
Carrier gas He
Substrate
Column diameter (mm) 0.25
Phase thickness (μm)
Program 45C(4min) => 30C/min => 60C (5min) => 3C/min => 220C(40min)
I 1710.
ReferenceZiegleder, 1998
Comment MSDC-RI

References

Fanaro, Duarte, et al., 2012
Fanaro, G.B.; Duarte, R.C.; Santillo, A.G.; Pinto e Silva, M.E.M.; Purgatto, E.; Villavicento, A.L.C.H., Evaluation of γ-radiation on oolong tea odor volatiles, Radiation Phys. Chem., 2012, 81, 8, 1152-1156, https://doi.org/10.1016/j.radphyschem.2011.11.061 . [all data]

Saidana, Mahjoub, et al., 2008
Saidana, D.; Mahjoub, M.A.; Boussaada, O.; Chriaa, J.; Cheraif, I.; Daami, M.; Mighri, Z.; Helal, A.N., Chemical composition and antimicrobial activity of volatile compounds of Tamarix boveana (Tamaricaceae), Microbiol. Res., 2008, 163, 4, 445-455, https://doi.org/10.1016/j.micres.2006.07.009 . [all data]

Fadel, Mageed, et al., 2006
Fadel, H.H.M.; Mageed, M.A.A.; Lotfy, S.N., Quality and flavour stability of coffee substitute prepared by extrusion of wheat germ and chicory roots, Amino Acids, 2006, https://doi.org/10.1007/s007260200008 . [all data]

Fadel, Mageed, et al., 2006, 2
Fadel, H.H.M.; Mageed, M.A.A.; Samad, A.K.M.E.A.; Lotfy, S.N., Cocoa substitute: Evaluation of sensory qualities and flavour stability, Eur. Food Res. Technol., 2006, 223, 1, 125-131, https://doi.org/10.1007/s00217-005-0162-3 . [all data]

de Souza, Vásquez, et al., 2006
de Souza, M.D.C.A.; Vásquez, P.; del Mastro, N.L.; Acree, T.E.; Lavin, E.H., Characterization and cachaca and rum aroma, J. Agric. Food Chem., 2006, 54, 2, 485-488, https://doi.org/10.1021/jf0511190 . [all data]

Boylston and Viniyard, 1998
Boylston, T.D.; Viniyard, B.T., Isolation of volatile flavor compounds from peanut butter using purge-and-trap technique in Instrumental Methods in Food and Beverage Analysis, D. Wetzel and G. Charalambous, ed(s)., 1998, 225-243. [all data]

Milo and Grosch, 1996
Milo, C.; Grosch, W., Changes in the odorants of boiled salmon and cod as affected by the storage of the raw material, J. Agric. Food Chem., 1996, 44, 8, 2366-2371, https://doi.org/10.1021/jf9507203 . [all data]

Drumm and Spanier, 1991
Drumm, T.D.; Spanier, A.M., Changes in the content of lipid autoxidation and sulfur-containing compounds in cooked beef during storage, J. Agric. Food Chem., 1991, 39, 2, 336-343, https://doi.org/10.1021/jf00002a023 . [all data]

Schieberle, 1991
Schieberle, P., Primary odorants in popcorn, J. Agric. Food Chem., 1991, 39, 6, 1141-1144, https://doi.org/10.1021/jf00006a030 . [all data]