Nitrous acid, 3-butenyl ester

Gas phase ion energetics data

Data compiled as indicated in comments:
LLK - Sharon G. Lias, Rhoda D. Levin, and Sherif A. Kafafi

Ionization energy determinations

IE (eV) Method Reference Comment
10.02PEHoule and Beauchamp, 1978Vertical value; LLK
10.02 ± 0.02PEHoule and Beauchamp, 1978Vertical value; LLK

References

Houle and Beauchamp, 1978
Houle, F.A.; Beauchamp, J.L., Detection and investigation of allyl and benzyl radicals by photoelectron spectroscopy, J. Am. Chem. Soc., 1978, 100, 3290. [all data]