Methyl sec-butyl disulphide

Kovats' RI, non-polar column, isothermal

View large format table.

Column type Active phase Temperature (C) I Reference Comment
PackedApiezon M130.1005.Garbuzov, Misharina, et al., 1985He or N2, Chromosorb W, AW-DMCS; Column length: 2.1 m

Normal alkane RI, non-polar column, custom temperature program

View large format table.

Column type Active phase I Reference Comment
CapillaryApieson M1005.Gao, Wang, et al., 2003Program: not specified

Normal alkane RI, polar column, custom temperature program

View large format table.

Column type Active phase I Reference Comment
CapillaryPEG-10001319.Gao, Wang, et al., 2003Program: not specified

References

Garbuzov, Misharina, et al., 1985
Garbuzov, V.G.; Misharina, T.A.; Aerov, A.F.; Golovnya, R.V., Gas chromatographic retention indices for sulphur(II)-containing organic substances, J. Anal. Chem. USSR (Engl. Transl.), 1985, 40, 4, 576-586. [all data]

Gao, Wang, et al., 2003
Gao, Y.; Wang, Y.; Yao, X.; Zhang, X.; Liu, M.; Hu, Z.; Fan, B., The prediction for gas chromatographic retention index of disulfides on stationary phases of different polarity, Talanta, 2003, 59, 2, 229-237, https://doi.org/10.1016/S0039-9140(02)00500-3 . [all data]