Benzaldehyde, 2-hydroxy-4-methoxy-

Kovats' RI, non-polar column, temperature ramp

View large format table.

Column type Active phase I Reference Comment
CapillarySSP-11296.Nagarajan, Rao, et al., 200130. m/0.32 mm/0.25 μm, He, 50. C @ 2. min, 2. K/min, 250. C @ 5. min

Kovats' RI, polar column, temperature ramp

View large format table.

Column type Active phase I Reference Comment
CapillaryDB-Wax2145.Nagarajan, Rao, et al., 200130. m/0.25 mm/0.25 μm, He, 60. C @ 5. min, 2. K/min, 220. C @ 5. min
CapillaryDB-Wax2135.Nagarajan, Rao, et al., 2001, 230. m/0.25 mm/0.25 μm, He, 60. C @ 5. min, 2. K/min, 220. C @ 5. min

Van Den Dool and Kratz RI, non-polar column, custom temperature program

View large format table.

Column type Active phase I Reference Comment
CapillaryVF-5MS1357.5Tret'yakov, 200830. m/0.25 mm/0.25 μm, He; Program: Multi-step temperature program; T(initial)=60C; T(final)=270C

Normal alkane RI, non-polar column, temperature ramp

View large format table.

Column type Active phase I Reference Comment
CapillaryVF-5 MS1335.Liu, Lu, et al., 201130. m/0.25 mm/0.25 μm, Helium, 40. C @ 3. min, 5. K/min, 250. C @ 3. min
CapillaryDB-51338.Miyazawa, Fujita, et al., 2004Helium, 2. K/min, 240. C @ 999. min; Column length: 50. m; Column diameter: 0.25 mm; Tstart: 60. C

Normal alkane RI, non-polar column, custom temperature program

View large format table.

Column type Active phase I Reference Comment
CapillaryVF-5 MS1357.Liu, Lu, et al., 201130. m/0.25 mm/0.25 μm, Helium; Program: not specified

References

Nagarajan, Rao, et al., 2001
Nagarajan, S.; Rao, L.J.M.; Gurudutt, K.N., Chemical composition of the volatiles of Hemidesmus indicus R. Br., Flavour Fragr. J., 2001, 16, 3, 212-214, https://doi.org/10.1002/ffj.985 . [all data]

Nagarajan, Rao, et al., 2001, 2
Nagarajan, S.; Rao, L.J.M.; Guirudutt, K.N., Chemical composition of the volatiles of Decalepis hamiltonii (Wight Arn), Flavour Fragr. J., 2001, 16, 1, 27-29, https://doi.org/10.1002/1099-1026(200101/02)16:1<27::AID-FFJ937>3.0.CO;2-F . [all data]

Tret'yakov, 2008
Tret'yakov, K.V., Retention Data. NIST Mass Spectrometry Data Center., NIST Mass Spectrometry Data Center, 2008. [all data]

Liu, Lu, et al., 2011
Liu, S.; Lu, S.; Su, Y.; Guo, Y., Analysis of volatile compounds in Radix Bupleuri injection by GC-MS-MS, Chromatographia, 2011, 74, 5-6, 497-502, https://doi.org/10.1007/s10337-011-2082-7 . [all data]

Miyazawa, Fujita, et al., 2004
Miyazawa, M.; Fujita, T.; Yamafuji, C.; Matsui, M.; Kasahara, N.; Takagi, Y.; Ishikawa, Y., Chemical composition of volatile oil from the roots of Periploca sepium, J. Oleo Sci., 2004, 53, 11, 511-513, https://doi.org/10.5650/jos.53.511 . [all data]