4-Heptenal, (Z)-

Normal alkane RI, non-polar column, temperature ramp

Data compiled by: NIST Mass Spectrometry Data Center, William E. Wallace, director

Column type CapillaryCapillaryCapillaryCapillaryCapillary
Active phase SPB-5RTX-5 MSHP-5 MSDB-1HP-5
Column length (m) 60.30.30.30.25.
Carrier gas  HeliumHeliumHeN2
Substrate
Column diameter (mm) 0.320.250.250.250.2
Phase thickness (μm) 1.000.500.250.250.5
Tstart (C) 40.35.50.30.30.
Tend (C) 230.225.280.210.280.
Heat rate (K/min) 3.6.4.5.3.
Initial hold (min) 5.5.
Final hold (min) 10.10.
I 900.901.897.871.900.
ReferenceSivadier, Ratel, et al., 2009Watcharananun, Cadwallader, et al., 2009Zhao, Zeng, et al., 2009Kumazawa, Itobe, et al., 2008Shafi, Nambiar, et al., 2004
Comment MSDC-RI MSDC-RI MSDC-RI MSDC-RI MSDC-RI
Column type CapillaryCapillaryCapillaryCapillaryCapillary
Active phase DB-5DB-5DB-5MSSE-54SE-54
Column length (m) 30.30.60.30.30.
Carrier gas HeHeHe
Substrate
Column diameter (mm) 0.320.320.250.520.52
Phase thickness (μm) 0.250.250.251.51.5
Tstart (C) 40.40.40.5.5.
Tend (C) 230.230.200.230.230.
Heat rate (K/min) 6.6.2.6.6.
Initial hold (min) 2.2.5.
Final hold (min) 10.10.30.
I 900.900.900.900.900.
ReferenceCzerny and Schieberle, 2002Czerny and Schieberle, 2002Lee, Suriyaphan, et al., 2001Milo and Grosch, 1996Milo and Grosch, 1996
Comment MSDC-RI MSDC-RI MSDC-RI MSDC-RI MSDC-RI
Column type CapillaryCapillary
Active phase SE-54RTX-5
Column length (m) 30.30.
Carrier gas  He
Substrate
Column diameter (mm) 0.520.52
Phase thickness (μm) 1.51.5
Tstart (C) 5.5.
Tend (C) 230.230.
Heat rate (K/min) 6.6.
Initial hold (min)
Final hold (min)
I 900.900.
ReferenceMilo and Grosch, 1996Milo and Grosch, 1995
Comment MSDC-RI MSDC-RI

Van Den Dool and Kratz RI, non-polar column, custom temperature program

Data compiled by: NIST Mass Spectrometry Data Center, William E. Wallace, director

Column type CapillaryCapillaryCapillaryCapillaryCapillary
Active phase SE-54DB-5MSDB-5MSHP-5MSDB-5
Column length (m) 30.30.30.30.25.
Carrier gas  HeHeHeHe
Substrate
Column diameter (mm) 0.320.320.320.250.32
Phase thickness (μm) 0.250.50.50.250.25
Program 40C(2min) => 6C/min => 150C => 20C/min => 230C50C => 5C/min => 200C => 8C/min => 260C(5min)70C(1min) => 3C/min => 80C(1min) => 5C/min => 150C => 10C/min => 280C (4min)5C(8min) => 3C/min => 20C => 10C/min => 150C(10min)35C (2min) => 40C/min => 50C (2min) => 4C/min => 240C (10min)
I 900.910.915.904.898.
ReferenceSchuh and Schieberle, 2006Selli, Rannou, et al., 2006Varlet V., Knockaert C., et al., 2006Bonaiti, Irlinger, et al., 2005Kirchhoff and Schieberle, 2002
Comment MSDC-RI MSDC-RI MSDC-RI MSDC-RI MSDC-RI
Column type CapillaryCapillaryCapillaryCapillaryCapillary
Active phase DB-5DB-5DB-5CP-Sil 8CB-MSDB-5
Column length (m) 30.25.30.60.30.
Carrier gas HeHeHeHe
Substrate
Column diameter (mm) 0.250.320.320.250.32
Phase thickness (μm) 0.250.250.250.250.25
Program 35 C (2 min) 40 C/min -> 50 C (2 min) 4 C/min -> 230 C35C(2min) => 40C/min => 50C(2min) => 4C/min => 240C(10min)35C(2min) => 40C/min => 60C (2min) => 4C/min => 240C0C(5min) => 40C/min => 40C (2min) => 4C/min => 280C40C(2min) => 40C/min => 50C (1min) => 6C/min => 180C => 10C/min => 240C (5min)
I 895.898.897.905.899.
ReferenceZehentbauer and Reineccius, 2002Kirchhoff and Schieberle, 2001Rychlik and Bosset, 2001Elmore, Mottram, et al., 2000Munk, Munch, et al., 2000
Comment MSDC-RI MSDC-RI MSDC-RI MSDC-RI MSDC-RI
Column type CapillaryCapillaryCapillaryCapillaryCapillary
Active phase DB-5SE-54DB-5SE-54SE-54
Column length (m) 30.25.30. 30.
Carrier gas  HeHe He
Substrate
Column diameter (mm) 0.320.320.25 0.32
Phase thickness (μm) 0.250.51. 0.3
Program 40C(2min) => 40C/min => 50C (1min) => 6C/min => 180C => 10C/min => 240C (5min)35C (2min) => 4C/min => 150C => 10C/min => 240C35C (2min) => 40C/min => 50C (1min) => 6C/min => 250C (10min)35C (2min) => 40C/min => 50C (1min) => 6C/min => 250C (10min)35C (2min) => 40 C/min => 50C (1min) => 6C/min => 250C
I 898.898.904.901.898.
ReferenceMunk, Munch, et al., 2000Fickert and Schieberle, 1998Triqui and Reineccius, 1995Triqui and Reineccius, 1995Triqui and Reineccius, 1995, 2
Comment MSDC-RI MSDC-RI MSDC-RI MSDC-RI MSDC-RI
Column type Capillary
Active phase SE-54
Column length (m) 30.
Carrier gas He
Substrate
Column diameter (mm) 0.32
Phase thickness (μm) 0.3
Program 35C (2min) => 40 C/min => 50C (1min) => 6C/min => 250C
I 901.
ReferenceTriqui and Reineccius, 1995, 2
Comment MSDC-RI

Van Den Dool and Kratz RI, polar column, custom temperature program

Data compiled by: NIST Mass Spectrometry Data Center, William E. Wallace, director

Column type CapillaryCapillaryCapillaryCapillaryCapillary
Active phase FFAPDB-WaxDB-WaxFFAPDB-Wax
Column length (m) 30.30.30.30.30.
Carrier gas  HeHeHeHe
Substrate
Column diameter (mm) 0.320.320.320.320.32
Phase thickness (μm) 0.250.50.50.250.5
Program 40C(2min) => 6C/min => 150C => 20C/min => 230C40C(5min) => 10C/min => 160C => 15C/min => 230C50C => 6C/min => 70C => 4C/min => 150C => 10C/min => 250C35C (2min) => 60C/min => 50C (2min) => 6C/min => 240C (10min)50C => 6C/min => 70C => 4C/min => 150C => 10C/min => 250C
I 1240.1233.1236.1238.1236.
ReferenceSchuh and Schieberle, 2006Hallier, Prost, et al., 2005Pennarun, Prost, et al., 2003Kirchhoff and Schieberle, 2002Pennarun, Prost, et al., 2002
Comment MSDC-RI MSDC-RI MSDC-RI MSDC-RI MSDC-RI
Column type CapillaryCapillaryCapillaryCapillaryCapillary
Active phase FFAPDB-WaxDB-FFAPDB-FFAPFFAP
Column length (m) 30.30.30.30.25.
Carrier gas HeHe  He
Substrate
Column diameter (mm) 0.320.320.320.320.32
Phase thickness (μm) 0.250.50.250.250.5
Program 40C(2min) => 40C/min => 60C(2min) => 6C/min => 240C(10min)50C => 5C/min => 180C => 10C/min => 250C40C(2min) => 40C/min => 60C (2min) => 6C/min => 180C => 10C/min => 240C (5min)40C(2min) => 40C/min => 60C (2min) => 6C/min => 180C => 10C/min => 240C (5min)35C (2min) => 40C/min => 60C => 6C/min => 230C (10min)
I 1238.1257.1223.1221.1246.
ReferenceKirchhoff and Schieberle, 2001Sérot, Regost, et al., 2001Munk, Munch, et al., 2000Munk, Munch, et al., 2000Fickert and Schieberle, 1998
Comment MSDC-RI MSDC-RI MSDC-RI MSDC-RI MSDC-RI
Column type CapillaryCapillaryCapillaryCapillary
Active phase DB-WaxDB-WaxDB-WaxSupelcowax-10
Column length (m) 30.30.30.60.
Carrier gas
Substrate
Column diameter (mm) 0.320.320.320.25
Phase thickness (μm) 0.50.50.50.25
Program 50C => 3C/min => 180C => 5C/min => 250C (15min)50C => 3C/min => 180C => 5C/min => 250C (15min)50C => 3C/min => 180C => 5C/min => 250C (15min)40C => (6C/min) => 80C(6min) => (15C/min) => 200C(10min)
I 1249.1251.1251.1239.
ReferenceProst, Serot, et al., 1998Prost, Serot, et al., 1998Prost, Serot, et al., 1998Baek and Cadwallader, 1996
Comment MSDC-RI MSDC-RI MSDC-RI MSDC-RI

Normal alkane RI, polar column, custom temperature program

Data compiled by: NIST Mass Spectrometry Data Center, William E. Wallace, director

Column type CapillaryCapillaryCapillaryCapillaryCapillary
Active phase DB-WaxHP-InnowaxSupelcowax-10DB-FFAPFFAP
Column length (m) 30.60.60.30.25.
Carrier gas HeliumNitrogen H2He
Substrate
Column diameter (mm) 0.250.250.250.30.32
Phase thickness (μm) 0.250.250.250.250.25
Program not specified50 0C (4 min) -> 40 0C 4 0C/min -> 220 0Cnot specified35C (1min) => 40C/min => 60C (5min) => 4C/min => 220C35C(2min) => 40C/min => 60C(2min) => 6C/min => 230C
I 1230.1225.1239.1234.1225.
ReferenceRochat, Egger, et al., 2009Quijano and Pino, 2006Baek and Cadwallader, 2003Triqui and Bouchriti, 2003Zehentbauer and Grosch, 1998
Comment MSDC-RI MSDC-RI MSDC-RI MSDC-RI MSDC-RI
Column type CapillaryCapillaryCapillaryCapillaryCapillary
Active phase FFAPFFAPSupelcowax 10Supelcowax 10Supelcowax-10
Column length (m) 30.30.60.60.30.
Carrier gas HeHeHeliumHeliumHe
Substrate
Column diameter (mm) 0.320.320.250.250.32
Phase thickness (μm) 0.250.250.250.25
Program 35C (2min) => 40C/min => 60C (2min) => 6C/min => 180C => 10C/min => 240C35C (2min) => 40C/min => 60C (2min) => 6C/min => 180C => 10C/min => 240C60 0C (10 min) 2 0C/min -> 80 0C 3 0C/min -> 100 0C 4 0C/min -> 220 0C (30 min)not specified35C => 40C/min => 60C(2min) => 4C/min => 240C
I 1246.1246.1234.1230.1219.
ReferenceSchermann and Schieberle, 1997Schermann and Schieberle, 1997Castioni and Kapetanidis, 1996Castioni and Kapetanidis, 1996Schieberle and Grosch, 1994
Comment MSDC-RI MSDC-RI MSDC-RI MSDC-RI MSDC-RI
Column type Capillary
Active phase DB-Wax
Column length (m) 30.
Carrier gas He
Substrate
Column diameter (mm) 0.25
Phase thickness (μm) 0.5
Program 35C => 40C/min => 50C(2min) => 6C/min => 200C
I 1245.
ReferenceMilo and Grosch, 1993
Comment MSDC-RI

References

Sivadier, Ratel, et al., 2009
Sivadier, G.; Ratel, J.; Engel, E., Latency and persistence of diet volatile biomarkers in lamb fats, J. Agric. Food Chem., 2009, 57, 2, 645-652, https://doi.org/10.1021/jf802467q . [all data]

Watcharananun, Cadwallader, et al., 2009
Watcharananun, W.; Cadwallader, K.R.; Huangrak, K.; Kim, H.; Lorjaroenphon, Y., Identification of predominant odorants in Thai desserts flavored by smoking with Tian Op, a traditional Thai scented candle, J. Agric. Food Chem., 2009, 57, 3, 996-1005, https://doi.org/10.1021/jf802674c . [all data]

Zhao, Zeng, et al., 2009
Zhao, C.; Zeng, Y.; Wan, M.; Li, R.; Liang, Y.; Li, C.; Zeng, Z.; Chau, F.-T., Comparative analysis of essential oils from eight herbal medicines with pungent flavor and cool nature by GC-MS and chemometric resolution methods, J. Sep. Sci., 2009, 32, 4, 660-670, https://doi.org/10.1002/jssc.200800484 . [all data]

Kumazawa, Itobe, et al., 2008
Kumazawa, K.; Itobe, T.; Nishimura, O.; Hamaguchi, T., A new approach to estimate the in-mouth release characteristics of odorants in chewing gum, Food Science and Technology Research, 2008, 14, 3, 269-276, https://doi.org/10.3136/fstr.14.269 . [all data]

Shafi, Nambiar, et al., 2004
Shafi, P.M.; Nambiar, M.K.G.; Clery, R.A.; Sarma, Y.R.; Veena, S.S., Composition and antifungal activity of the oil of Artemisia nilagirica (Clarke) Pamp, J. Essent. Oil Res., 2004, 16, 4, 377-379, https://doi.org/10.1080/10412905.2004.9698748 . [all data]

Czerny and Schieberle, 2002
Czerny, M.; Schieberle, P., Important aroma compounds in freshly ground wholemeal and white wheat flour-identification and quantitative changes during sourdough fermentation, J. Agric. Food Chem., 2002, 50, 23, 6835-6840, https://doi.org/10.1021/jf020638p . [all data]

Lee, Suriyaphan, et al., 2001
Lee, G.-H.; Suriyaphan, O.; Cadwallader, K.R., Aroma components of cooked tail meat of American lobster (Homarus americanus), J. Agric. Food Chem., 2001, 49, 9, 4324-4332, https://doi.org/10.1021/jf001523t . [all data]

Milo and Grosch, 1996
Milo, C.; Grosch, W., Changes in the odorants of boiled salmon and cod as affected by the storage of the raw material, J. Agric. Food Chem., 1996, 44, 8, 2366-2371, https://doi.org/10.1021/jf9507203 . [all data]

Milo and Grosch, 1995
Milo, C.; Grosch, W., Detection of odor defects in boiled cod and trout by gas chromatography-olfactometry of headspace samples, J. Agric. Food Chem., 1995, 43, 2, 459-462, https://doi.org/10.1021/jf00050a038 . [all data]