Acetamide, N-(1-methylhexyl)-

Normal alkane RI, non-polar column, custom temperature program

View large format table.

Column type Active phase I Reference Comment
CapillarySE-301269.Lou, Liu, et al., 1993Column diameter: 0.25 mm; Program: not specified

References

Lou, Liu, et al., 1993
Lou, X.; Liu, X.; Zhou, L., Chiral recognition of enantiomeric amides on a diamide chiral stationary phase by gas chromatography, J. Chromatogr., 1993, 634, 2, 345-349, https://doi.org/10.1016/0021-9673(93)83024-M . [all data]