Selenoacetaldehyde

Gas phase ion energetics data

Data compiled as indicated in comments:
LBLHLM - Sharon G. Lias, John E. Bartmess, Joel F. Liebman, John L. Holmes, Rhoda D. Levin, and W. Gary Mallard

Ionization energy determinations

IE (eV) Method Reference Comment
8.3PEBock, Aygen, et al., 1984LBLHLM
8.5PEBock, Aygen, et al., 1984Vertical value; LBLHLM

References

Bock, Aygen, et al., 1984
Bock, H.; Aygen, S.; Rosmus, P.; Solouki, B.; Weissflog, E., Gasphasen-reaktionen,40. Selenoformaldehyd: Hochkorrelierte wellenfunktion und photoelektronenspektroskopischer nachweis, Chem. Ber., 1984, 117, 187. [all data]