Di-n-eicosanyl arsenic acid

Phase change data

Data compiled as indicated in comments:
TRC - Thermodynamics Research Center, NIST Boulder Laboratories, Chris Muzny director
AC - William E. Acree, Jr., James S. Chickos

Quantity Value Units Method Reference Comment
Tfus393.KN/ASmith, Irgolic, et al., 1970Crystal phase 1 phase; Uncertainty assigned by TRC = 1. K; by DTA; TRC

Enthalpy of fusion

ΔfusH (kJ/mol) Temperature (K) Method Reference Comment
76.9393.DTASmith, Irgolic, et al., 1970, 2AC

In addition to the Thermodynamics Research Center (TRC) data available from this site, much more physical and chemical property data is available from the following TRC products:

References

Smith, Irgolic, et al., 1970
Smith, M.R.; Irgolic, K.J.; Meyers, E.A.; Zingaro, R.A., The enthalpies of fusion and transition and X-ray powder patterns of 20 DI-n-alkylarsinic acids, Thermochim. Acta, 1970, 1, 1, 51, https://doi.org/10.1016/0040-6031(70)85028-6 . [all data]

Smith, Irgolic, et al., 1970, 2
Smith, Milton R.; Irgolic, Kurt J.; Meyers, Edward A.; Zingaro, Ralph A., The enthalpies of fusion and transition and X-ray powder patterns of 20 DI-n-alkylarsinic acids, Thermochimica Acta, 1970, 1, 1, 51-60, https://doi.org/10.1016/0040-6031(70)85028-6 . [all data]