Nitrobenzene, 3-(2-cyano-2-phenylethenyl)

Condensed phase thermochemistry data

Data compiled by: Hussein Y. Afeefy, Joel F. Liebman, and Stephen E. Stein

Quantity Value Units Method Reference Comment
Δfsolid176.kJ/molCcbZavoianu, Contineanu, et al., 1986Authors hf298_condensed=137 kJ/mol
Δfsolid172.9kJ/molCcbZavoianu, Perisanu, et al., 1982Authors hf298_condensed=34.23 kcal/mol
Quantity Value Units Method Reference Comment
Δcsolid-7508.kJ/molCcbZavoianu, Contineanu, et al., 1986Authors hf298_condensed=137 kJ/mol
Δcsolid-7504.76kJ/molCcbZavoianu, Perisanu, et al., 1982Authors hf298_condensed=34.23 kcal/mol

References

Zavoianu, Contineanu, et al., 1986
Zavoianu, D.; Contineanu, I.; Moga-Gheorghe, S.; Marchidan, D., Structure and reactivity of nitriles. Condensation reaction of phenylacetonitrile with benzaldehydes, Rev. Chim. (Bucharest), 1986, 37, 1055-1058. [all data]

Zavoianu, Perisanu, et al., 1982
Zavoianu, D.; Perisanu, S.; Moga-Gheorghe, S.; Bornaz, C.; Gaman, V.; Radulescu, A., Structure and reactivity of nitriles. Heat of combustion and of formation of unsaturated α,β-nitriles derived from benzylidenephenylacetonitrile, Rev. Chim. (Bucharest), 1982, 33, 432-434. [all data]