Bis(methylammonium) hexaiodotellurate

Condensed phase thermochemistry data

Data compiled by: Eugene S. Domalski and Elizabeth D. Hearing

Quantity Value Units Method Reference Comment
solid,1 bar639.71J/mol*KN/AOnoda, Matsuo, et al., 1986

Constant pressure heat capacity of solid

Cp,solid (J/mol*K) Temperature (K) Reference Comment
307.05298.15Onoda, Matsuo, et al., 1986T = 12 to 300 K.

Phase change data

Data compiled by: Eugene S. Domalski and Elizabeth D. Hearing

Enthalpy of phase transition

ΔHtrs (kJ/mol) Temperature (K) Initial Phase Final Phase Reference Comment
0.40366.1crystaline, IIIcrystaline, IIOnoda, Matsuo, et al., 1986
2.555115.6crystaline, IIcrystaline, IOnoda, Matsuo, et al., 1986

Entropy of phase transition

ΔStrs (J/mol*K) Temperature (K) Initial Phase Final Phase Reference Comment
6.166.1crystaline, IIIcrystaline, IIOnoda, Matsuo, et al., 1986
22.1115.6crystaline, IIcrystaline, IOnoda, Matsuo, et al., 1986

References

Onoda, Matsuo, et al., 1986
Onoda, N.; Matsuo, T.; Suga, H., Calorimetric and IR spectroscopic study of phase transitions in methylammonium hexabromotellurate and methylammonium hexaiodotellurate, J. Phys. Chem. Solids, 1986, 47, 211-223. [all data]