1,2-Diazetidine,1,2-dimethyl-trans-

Gas phase ion energetics data

Data compiled by: Sharon G. Lias, Rhoda D. Levin, and Sherif A. Kafafi

Ionization energy determinations

IE (eV) Method Reference Comment
8.12PENelsen, Peacock, et al., 1978Vertical value

References

Nelsen, Peacock, et al., 1978
Nelsen, S.F.; Peacock, V.E.; Weisman, G.R.; Landis, M.E.; Spencer, J.A., Conformations of four-membered ring hydrazines and hydrazine radical cations, J. Am. Chem. Soc., 1978, 100, 2806. [all data]