Diplumbane, hexamethyl-

Gas phase ion energetics data

Data compiled by: Sharon G. Lias, Rhoda D. Levin, and Sherif A. Kafafi

Ionization energy determinations

IE (eV) Method Reference
7.41 ± 0.10EILappert, Pedley, et al., 1971

Appearance energy determinations

Ion AE (eV) Other Products MethodReferenceComment
C3H9Pb+9.02 ± 0.14(CH3)3PbEILappert, Pedley, et al., 1971

References

Lappert, Pedley, et al., 1971
Lappert, M.F.; Pedley, J.B.; Simpson, J.; Spalding, T.R., Bonding studies of compounds of boron and the Group IV elements. VI. Mass spectrometric studies on compounds Me4M and Me3M-M'Me3 (M and M'=C, Si, Ge, Sn, and Pb): thermochemical data, J. Organomet. Chem., 1971, 29, 195. [all data]