2-Methylbutyl octanoate

Normal alkane RI, non-polar column, temperature ramp

Data compiled by: NIST Mass Spectrometry Data Center, William E. Wallace, director

Column type Capillary
Active phase OV-101
Column length (m) 50.
Carrier gas He
Substrate
Column diameter (mm) 0.22
Phase thickness (μm) 1.
Tstart (C) 100.
Tend (C) 220.
Heat rate (K/min) 1.
Initial hold (min) 1.
Final hold (min)
I 1430.
ReferenceCamciuc, Bessière, et al., 1998
Comment MSDC-RI

References

Camciuc, Bessière, et al., 1998
Camciuc, M.; Bessière, J.M.; Vilarem, G.; Gaset, A., Volatile components in okra seed coat, Phytochemistry, 1998, 48, 2, 311-315, https://doi.org/10.1016/S0031-9422(97)01127-8 . [all data]