Benzamide, N-(1-methylethyl)-4-[(2-methylhydrazino)methyl]-

Normal alkane RI, non-polar column, temperature ramp

Data compiled by: NIST Mass Spectrometry Data Center, William E. Wallace, director

Column type PackedPacked
Active phase SE-30OV-1
Column length (m) 2.2.
Carrier gas
Substrate Gas Chrom PGas Chrom P
Column diameter (mm)
Phase thickness (μm)
Tstart (C) 120.120.
Tend (C) 200.200.
Heat rate (K/min) 2.52.5
Initial hold (min)
Final hold (min)
I 1975.2000.
ReferenceMarozzi, Gambaro, et al., 1982Marozzi, Gambaro, et al., 1982
Comment MSDC-RI MSDC-RI

Van Den Dool and Kratz RI, non-polar column, temperature ramp

View large format table.

Column type Active phase I Reference Comment
PackedSE-301990.Perrigo and Peel, 1981N2, Chromosorb W, 130. C @ 2. min, 8. K/min, 290. C @ 8. min; Column length: 1.8 m

Normal alkane RI, non-polar column, custom temperature program

View large format table.

Column type Active phase I Reference Comment
OtherMethyl Silicone1990.Ardrey and Moffat, 1981Program: not specified

References

Marozzi, Gambaro, et al., 1982
Marozzi, E.; Gambaro, V.; Saligari, E.; Mariani, R.; Lodi, F., Use of the retention index in gas chromatographic studies of drugs, J. Anal. Toxicol., 1982, 6, 4, 185-192, https://doi.org/10.1093/jat/6.4.185 . [all data]