1,1-Biazetidine

Gas phase ion energetics data

Data compiled as indicated in comments:
LBLHLM - Sharon G. Lias, John E. Bartmess, Joel F. Liebman, John L. Holmes, Rhoda D. Levin, and W. Gary Mallard
LLK - Sharon G. Lias, Rhoda D. Levin, and Sherif A. Kafafi

Ionization energy determinations

IE (eV) Method Reference Comment
9.16PENelsen, 1984Vertical value; LBLHLM
8.2PENelsen, Peacock, et al., 1978Vertical value; LLK

References

Nelsen, 1984
Nelsen, S.F., Ionization from nitrogen and oxygen lone pairs: A comparison of trialkylamine, dialkyl ether, tetraalkylhydrazine, and dialkyl peroxide photoelectron spectroscopic ionization potentials, J. Org. Chem., 1984, 49, 1891. [all data]

Nelsen, Peacock, et al., 1978
Nelsen, S.F.; Peacock, V.E.; Weisman, G.R.; Landis, M.E.; Spencer, J.A., Conformations of four-membered ring hydrazines and hydrazine radical cations, J. Am. Chem. Soc., 1978, 100, 2806. [all data]