Tricyclo[4.3.2.0(1,6)]undeca-2,4-diene

Reaction thermochemistry data

Data compiled by: Hussein Y. Afeefy, Joel F. Liebman, and Stephen E. Stein

Individual Reactions

2Hydrogen + Tricyclo[4.3.2.0(1,6)]undeca-2,4-diene = 3a,7a-Ethano-1H-indene, hexahydro-

By formula: 2H2 + C11H14 = C11H18

Quantity Value Units Method Reference Comment
Δr-49.3 ± 0.2kcal/molChydRoth, Klarner, et al., 1992liquid phase; solvent: Isooctane

References

Roth, Klarner, et al., 1992
Roth, W.R.; Klarner, F.-G.; Siepert, G.; Lennartz, H.-W., Zur Frage der Homoaromatizitat von Norcaradien und Cycloheptatrien, Chem. Ber., 1992, 125, 217-224. [all data]