SiCl2+

Vibrational and/or electronic energy levels

Data compiled by: Marilyn E. Jacox

State:   F

 Energy
 (cm-1
 Med.   Transition   λmin
 (nm)
 λmax
 (nm)

References

Txx = 52850 ± 1000 gas Bock, Solouki, et al., 1985

State:   E

 Energy
 (cm-1
 Med.   Transition   λmin
 (nm)
 λmax
 (nm)

Txx = 30260 ± 1000 gas Bock, Solouki, et al., 1985

State:   C,D

 Energy
 (cm-1
 Med.   Transition   λmin
 (nm)
 λmax
 (nm)

Txx = 23800 ± 1000 gas Bock, Solouki, et al., 1985

State:   A,B

 Energy
 (cm-1
 Med.   Transition   λmin
 (nm)
 λmax
 (nm)

Txx = 14120 ± 400 gas Bock, Solouki, et al., 1985

Additional references: Jacox, 1994, page 92

Bock, Solouki, et al., 1985
Bock, H.; Solouki, B.; Maier, G., SiCl2: Photoelektronenspektroskopische Optimierung verschiedener Synthesen, Angew. Chem., 1985, 97, 205. [all data]

Jacox, 1994
Jacox, M.E., Vibrational and electronic energy levels of polyatomic transient molecules, American Chemical Society, Washington, DC, 1994, 464. [all data]