Morphinan-6-ol, 7,8-didehydro-4,5-epoxy-3-methoxy-17-methyl-, acetate (ester), (5α,6α)-

Kovats' RI, non-polar column, isothermal

View large format table.

Column type Active phase Temperature (C) I Reference Comment
PackedSE-30240.2480.Musumarra, Scarlata, et al., 1987N2, 1% se-30 on Anachrom ABS(80-100mesh); Column length: 2. m
CapillarySPB-1250.2530.Lora-Tamayo, Rams, et al., 1986He; Column length: 25. m; Column diameter: 0.20 mm
PackedOV-1250.2535.Machata and Vycudilik, 1980N2, Chromosorb G

Van Den Dool and Kratz RI, non-polar column, temperature ramp

View large format table.

Column type Active phase I Reference Comment
CapillaryDB-12480.Perrigo, Ballantyne, et al., 198415. m/0.25 mm/0.25 μm, He, 8. K/min, 280. C @ 5. min; Tstart: 120. C

Van Den Dool and Kratz RI, non-polar column, custom temperature program

View large format table.

Column type Active phase I Reference Comment
CapillaryBP-12484.Stowell and Wilson, 198712. m/0.22 mm/0.25 μm, He; Program: 120C => 8C/min => 270C => 25C/min => 300C

Normal alkane RI, non-polar column, temperature ramp

View large format table.

Column type Active phase I Reference Comment
PackedSE-302510.MHA, 9999Nitrogen, Chromosorb G AW DMCS (80-100 mesh); Column length: 2. m; Tstart: 100. C; Tend: 300. C
CapillaryPolymethylsiloxane, (PMS-20000)2503.Gambaro, Saligari, et al., 199712. m/0.20 mm/0.33 μm, He, 10. K/min; Tstart: 160. C; Tend: 300. C
CapillaryBP-12480.Stowell and Wilson, 198512. m/0.22 mm/0.25 μm, He, 8. K/min; Tstart: 120. C; Tend: 280. C

Normal alkane RI, non-polar column, custom temperature program

View large format table.

Column type Active phase I Reference Comment
CapillaryPolymethylsiloxane, (PMS-20000)2502.Gambaro, Saligari, et al., 199712. m/0.20 mm/0.33 μm, He; Program: not specified
CapillaryPolydimethyl siloxanes2505.Schutz and Wollrab A., 1988Program: not specified
CapillaryBP-12483.Stowell and Wilson, 198512. m/0.22 mm/0.25 μm, He; Program: 120 0X 8 0C/min -> 270 0C 25 0C/min -> 300 0C (5 min)
CapillaryBP-12485.Stowell and Wilson, 198512. m/0.22 mm/0.25 μm, He; Program: 120 0X 8 0C/min -> 270 0C 25 0C/min -> 300 0C (5 min)
CapillaryBP-12485.Stowell and Wilson, 198512. m/0.22 mm/0.25 μm, He; Program: 120 0X 8 0C/min -> 270 0C 25 0C/min -> 300 0C (5 min)
CapillaryBP-12484.Stowell and Wilson, 198512. m/0.22 mm/0.25 μm, He; Program: 120 0X 8 0C/min -> 270 0C 25 0C/min -> 300 0C (5 min)
CapillaryOV-1, SE-30, Methyl silicone, SP-2100, OV-101, DB-1, etc.2530.Waggott and Davies, 1984Hydrogen; Column length: 50. m; Column diameter: 0.32 mm; Program: not specified
OtherMethyl Silicone2510.Ardrey and Moffat, 1981Program: not specified

References

Musumarra, Scarlata, et al., 1987
Musumarra, G.; Scarlata, G.; Romano, G.; Cappello, G.; Clementi, S.; Giulietti, G., Qualitative organic analysis. Part 2. Identification of drugs by principal components analysis of standardized TLC data in four eluent systems and of retention indices on SE 30, J. Anal. Toxicol., 1987, 11, 4, 154-163, https://doi.org/10.1093/jat/11.4.154 . [all data]

Lora-Tamayo, Rams, et al., 1986
Lora-Tamayo, C.; Rams, M.A.; Chacon, J.M.R., Gas Chromatographic Data for 187 Nitrogen- or Phosphorus-Containing Drugs and Metabolites of Toxicological Interest Analysed on Methyl Silicone Capillary Columns, J. Chromatogr., 1986, 374, 73-85, https://doi.org/10.1016/S0378-4347(00)83254-5 . [all data]

Machata and Vycudilik, 1980
Machata, G.; Vycudilik, W., Gas chromatographic analysis of illicit heroin samples, J. Anal. Toxicol., 1980, 4, 6, 318-321, https://doi.org/10.1093/jat/4.6.318 . [all data]

Perrigo, Ballantyne, et al., 1984
Perrigo, B.J.; Ballantyne, D.J.; Peel, H.W., Condierations in developing a data base for drugs on a DBI capillary column, J. Can. Soc. Forensic Sci., 1984, 17, 2, 41-49, https://doi.org/10.1080/00085030.1984.10757360 . [all data]

Stowell and Wilson, 1987
Stowell, A.; Wilson, L.W., A simple approach to the interlaboratory transfer of drug retention indices determined by temperature programmed capillary gas chromatography, J. Forensic Sci., 1987, 32, 5, 1214-1220. [all data]

MHA, 9999
MHA, Directorate of ForensicScience., Forensic Toxicology, 9999. [all data]

Gambaro, Saligari, et al., 1997
Gambaro, V.; Saligari, E.; Froldi, R.; Bianchi, L., Analysis of street drugs by means of HRGC, Bollettino Chimico Farmaceutica, 1997, 36, 4, 359-367. [all data]

Stowell and Wilson, 1985
Stowell, A.; Wilson, L., Use of retention indices in drug screening by capillary gas chromatography, Rep. # CD 2362, Department of Scientific and Industrial Reseach, Chemistry Division, Lower Hutt, NZ, 1985, 32. [all data]

Schutz and Wollrab A., 1988
Schutz, H.; Wollrab A., The significance of the retention index in toxicologic analysis II, Pharmazie in unzerer Zeit, 1988, 17, 4, 97-101. [all data]

Waggott and Davies, 1984
Waggott, A.; Davies, I.W., Identification of organic pollutants using linear temperature programmed retention indices (LTPRIs) - Part II, 1984, retrieved from http://dwi.defra.gov.uk/research/completed-research/reports/dwi0383.pdf. [all data]

Ardrey and Moffat, 1981
Ardrey, R.E.; Moffat, A.C., Gas-liquid chromatographic retention indices of 1318 substances of toxicological interest on SE-30 or OV-1 stationary phase, J. Chromatogr., 1981, 220, 3, 195-252, https://doi.org/10.1016/S0021-9673(00)81925-1 . [all data]