Dibenzo[b,e][1,4]dioxin, 1,3,7-trichloro-

Phase change data

Data compiled as indicated in comments:
TRC - Thermodynamics Research Center, NIST Boulder Laboratories, Chris Muzny director
AC - William E. Acree, Jr., James S. Chickos

Quantity Value Units Method Reference Comment
Tfus421.7KN/ARordorf, 1986Uncertainty assigned by TRC = 0.1 K; TRC

Enthalpy of sublimation

ΔsubH (kJ/mol) Temperature (K) Method Reference Comment
116.2342.TRordorf, 1989Based on data from 310. - 373. K. See also Rordorf, 1986, 2.; AC

Enthalpy of fusion

ΔfusH (kJ/mol) Temperature (K) Reference Comment
30.8421.7Rordorf, 1986, 3AC

In addition to the Thermodynamics Research Center (TRC) data available from this site, much more physical and chemical property data is available from the following TRC products:

References

Rordorf, 1986
Rordorf, B.F., Proc. 5th Interna. Sympo. on Chlorinated Dioxins and Related Compounds, Bayreuth, 1986. [all data]

Rordorf, 1989
Rordorf, Berchtold F., Prediction of vapor pressures, boiling points and enthalpies of fusion for twenty-nine halogenated dibenzo-p-dioxins and fifty-five dibenzofurans by a vapor pressure correlation method, Chemosphere, 1989, 18, 1-6, 783-788, https://doi.org/10.1016/0045-6535(89)90196-3 . [all data]

Rordorf, 1986, 2
Rordorf, Berchtold F., Thermal properties of dioxins, furans and related compounds, Chemosphere, 1986, 15, 9-12, 1325-1332, https://doi.org/10.1016/0045-6535(86)90407-8 . [all data]

Rordorf, 1986, 3
Rordorf, B.F., , Proceedings of the Fifth International Symposium on Chlorinated Dioxins and Related Compounds (16-19 September), Bayreuth, Germany, 1986. [all data]