bis(perfluorovinyl)chloroborine

Phase change data

Data compiled by: William E. Acree, Jr., James S. Chickos

Enthalpy of vaporization

ΔvapH (kcal/mol) Temperature (K) Method Reference Comment
8.51301.TStafford and Stone, 1960Based on data from 280. - 322. K.

References

Stafford and Stone, 1960
Stafford, S.L.; Stone, F.G.A., Organoboron Halides. V. Perfluorovinylboron Compounds 1,2, J. Am. Chem. Soc., 1960, 82, 24, 6238-6240, https://doi.org/10.1021/ja01509a007 . [all data]