Ficusin

Normal alkane RI, non-polar column, temperature ramp

Data compiled by: NIST Mass Spectrometry Data Center, William E. Wallace, director

Column type CapillaryCapillary
Active phase DB-5Elite-5MS
Column length (m)  30.
Carrier gas ArgonHe
Substrate
Column diameter (mm)  0.32
Phase thickness (μm)  0.5
Tstart (C) 80.40.
Tend (C) 200.280.
Heat rate (K/min) 0.94.
Initial hold (min)  5.
Final hold (min)  10.
I 1842.1828.
ReferenceOrlita, Sidwa-Gorycka, et al., 2008Tava, Pecetti, et al., 2007
Comment MSDC-RI MSDC-RI

Van Den Dool and Kratz RI, non-polar column, custom temperature program

Data compiled by: NIST Mass Spectrometry Data Center, William E. Wallace, director

Column type Capillary
Active phase HP-5MS
Column length (m) 30.
Carrier gas He
Substrate
Column diameter (mm) 0.25
Phase thickness (μm) 0.25
Program 60C (1 min) => 5 C/min => 210C => 10 C/min => 280C (15 min)
I 1847.3
ReferenceAndriamaharavo, 2014
Comment MSDC-RI

References

Orlita, Sidwa-Gorycka, et al., 2008
Orlita, A.; Sidwa-Gorycka, M.; Kumirska, J.; Malinski, E.; Siedlecka, E.M.; Gajdus, J.; Lojkowska, E.; Stepnowski, P., Identification of Ruta graveolens L. metabolites accumulated in the presence of abiotic elicitors, Biotechnol. Prog., 2008, 24, 1, 128-133, https://doi.org/10.1021/bp070261d . [all data]

Tava, Pecetti, et al., 2007
Tava, A.; Pecetti, L.; Ricci, M.; Pagnotta, M.A.; Russi, L., Volatile compounds from leaves and flowers of Bituminaria bituminosa (L.) Stirt. (Fabaceae) from Italy, Flavour Fragr. J., 2007, 22, 5, 363-370, https://doi.org/10.1002/ffj.1806 . [all data]