Pentaerythritol tetrakis[3-(3',5'-di-tert-butyl-4'-hydroxyphenyl)propionate]

Phase change data

Data compiled by: William E. Acree, Jr., James S. Chickos

Enthalpy of fusion

ΔfusH (kcal/mol) Temperature (K) Method Reference
15.76385.8DSCWei and Chen, 2009

References

Wei and Chen, 2009
Wei, Dongwei; Chen, Limei, Solubility of antioxidant 1010 in pure alkanols, Fluid Phase Equilibria, 2009, 277, 1, 9-14, https://doi.org/10.1016/j.fluid.2008.11.005 . [all data]