1,3-Cyclobutadiene,1,2,3,4-tetrakis(t-butyl)

Gas phase ion energetics data

Data compiled as indicated in comments:
LLK - Sharon G. Lias, Rhoda D. Levin, and Sherif A. Kafafi

Ionization energy determinations

IE (eV) Method Reference Comment
5.9PEHeilbronner, Jones, et al., 1980LLK
6.35PEHeilbronner, Jones, et al., 1980Vertical value; LLK

References

Heilbronner, Jones, et al., 1980
Heilbronner, E.; Jones, T.B.; Krebs, A.; Maier, G.; Malsch, K.D.; Pocklington, J.; Schmelzer, A., A photoelectron spectroscopic investigation of tetra-tert-butyltetrahedrane and of tetra-tert-butylcyclobutadiene, J. Am. Chem. Soc., 1980, 102, 564. [all data]