2,4-bis(bromodimethylsilyl)-2,4-dicarbo-closo-heptaborane (7)

Phase change data

Data compiled by: William E. Acree, Jr., James S. Chickos

Enthalpy of vaporization

ΔvapH (kcal/mol) Temperature (K) Method Reference Comment
12.7403.IGolosova, Shmyreva, et al., 1979Based on data from 388. - 463. K.
12.7403.IGolosova, Shmyreva, et al., 1979Based on data from 388. - 463. K.

References

Golosova, Shmyreva, et al., 1979
Golosova, R.M.; Shmyreva, G.O.; Shlyakova, V.G.; Petrunin, A.B.; Bekker, D.B.; Zhigach, A.F., Zh. Fiz. Khim., 1979, 53, 766. [all data]