Pyrimido[1,2-a]azepine, 2,3,4,6,7,8,9,10-octahydro-

Gas phase ion energetics data

Data evaluated by: Edward P. Hunter and Sharon G. Lias

Quantity Value Units Method Reference Comment
Proton affinity (review)250.45kcal/molN/AHunter and Lias, 1998
Quantity Value Units Method Reference Comment
Gas basicity242.71kcal/molN/AHunter and Lias, 1998

Phase change data

Data compiled by: Robert L. Brown and Stephen E. Stein

Reduced pressure boiling point

Tboil (K) Pressure (atm) Reference
354.70.0008Aldrich Chemical Company Inc., 1990

References

Hunter and Lias, 1998
Hunter, E.P.; Lias, S.G., Evaluated Gas Phase Basicities and Proton Affinities of Molecules: An Update, J. Phys. Chem. Ref. Data, 1998, 27, 3, 413-656, https://doi.org/10.1063/1.556018 . [all data]