2,3-Dioxabicyclo[2.2.2]oct-5-ene

Gas phase ion energetics data

Data compiled by: Sharon G. Lias, Rhoda D. Levin, and Sherif A. Kafafi

Ionization energy determinations

IE (eV) Method Reference Comment
8.76PEGleiter, Schang, et al., 1980Vertical value

References

Gleiter, Schang, et al., 1980
Gleiter, R.; Schang, P.; Adam, W.; Eggelte, H.J.; Erden, I.; Bloodworth, A.J., Photoelectron spectra of bicyclic peroxides, J. Electron Spectrosc. Relat. Phenom., 1980, 19, 223. [all data]