2(1,4-Naphthoquinine)-(1,4-naphthohydroquinone)(C10H8O2)

Phase change data

Data compiled by: William E. Acree, Jr., James S. Chickos

Enthalpy of sublimation

ΔsubH (kJ/mol) Temperature (K) Method Reference
89. ± 3.328.5ME,TEde Kruif, 1981

References

de Kruif, 1981
de Kruif, C.G., Thermodynamic properties of 1,4-benzoquinone (BQ), 1,4-hydroquinone (HQ), 1,4-naphthoquinone (NQ), 1,4-naphthohydroquinone (NHQ), and the complexes BQ--HQ 1:1, NQ--HQ 1:1, NQ--NHQ 2:1, and NQ--NHQ 1:1, J. Chem. Phys., 1981, 74, 10, 5838, https://doi.org/10.1063/1.440898 . [all data]