CAS Reg. No. 66524-41-2

Reaction thermochemistry data

Data compiled by: John E. Bartmess

Individual Reactions

(CAS Reg. No. 66524-41-2 • 4294967295sulfur) + sulfur = CAS Reg. No. 66524-41-2

By formula: (CAS Reg. No. 66524-41-2 • 4294967295S) + S = CAS Reg. No. 66524-41-2

Quantity Value Units Method Reference Comment
Δr349. ± 9.6kJ/molN/AHunsicker, Jones, et al., 1995gas phase; Vertical Detachment Energy: 3.55 eV. An isomer exists with EA=2.26 eV

References

Hunsicker, Jones, et al., 1995
Hunsicker, S.; Jones, R.O.; Gantefor, G., Rings and chains in sulfur cluster anions S- to S-9(-): Theory (simulated annealing) and experiment (photoelectron detachment), J. Chem. Phys., 1995, 102, 15, 5917, https://doi.org/10.1063/1.469326 . [all data]