Iridium, (2,4-pentanedionato-o,o'-)-bisη2-propene

Phase change data

Data compiled as indicated in comments:
MS - José A. Martinho Simões
AC - William E. Acree, Jr., James S. Chickos

Quantity Value Units Method Reference Comment
Δsub21.5 ± 0.31kcal/molN/AJesse, Ernsting, et al., 1978MS

Enthalpy of sublimation

ΔsubH (kcal/mol) Temperature (K) Method Reference Comment
22. ± 0.31287.MEJesse, Ernsting, et al., 1978, 2Based on data from 269. - 304. K.; AC

References

Jesse, Ernsting, et al., 1978
Jesse, A.C.; Ernsting, J.M.; Stufkens, D.J.; Vrieze, K., Thermochim. Acta, 1978, 25, 69. [all data]

Jesse, Ernsting, et al., 1978, 2
Jesse, A.C.; Ernsting, J.M.; Stufkens, D.J.; Vrieze, K., Vapour pressure measurements on (acac)M(substituted olefin)2 and (acac)M(CO)2 (M = Rh(I), Ir(I)), Thermochimica Acta, 1978, 25, 1, 69-75, https://doi.org/10.1016/0040-6031(78)80041-0 . [all data]