4,5-Dichloro-2-nitroaniline

Phase change data

Data compiled by: William E. Acree, Jr., James S. Chickos

Quantity Value Units Method Reference Comment
Δsub26.1 ± 0.2kcal/molMERibeiro da Silva, Ribeiro da Silva, et al., 2009Based on data from 351. - 367. K.

Enthalpy of sublimation

ΔsubH (kcal/mol) Temperature (K) Method Reference Comment
25.9 ± 0.2359.MERibeiro da Silva, Ribeiro da Silva, et al., 2009Based on data from 351. - 367. K.

References

Ribeiro da Silva, Ribeiro da Silva, et al., 2009
Ribeiro da Silva, Manuel A.V.; Ribeiro da Silva, Maria D.M.C.; Lobo Ferreira, Ana I.M.C.; Santos, Ana Filipa L.O.M.; Galvão, Tiago L.P., Experimental thermochemical study of 4,5-dichloro-2-nitroaniline, The Journal of Chemical Thermodynamics, 2009, 41, 11, 1247-1253, https://doi.org/10.1016/j.jct.2009.05.013 . [all data]