2,4,5-Trichlorotoluene

Phase change data

Data compiled by: Robert L. Brown and Stephen E. Stein

Reduced pressure boiling point

Tboil (K) Pressure (atm) Reference
502.70.942Weast and Grasselli, 1989

Gas phase ion energetics data

Data compiled by: Sharon G. Lias and Joel F. Liebman

Ionization energy determinations

IE (eV) Method Reference
8.80PEFujisawa, Oonishi, et al., 1992

References

Weast and Grasselli, 1989
CRC Handbook of Data on Organic Compounds, 2nd Editon, Weast,R.C and Grasselli, J.G., ed(s)., CRC Press, Inc., Boca Raton, FL, 1989, 1. [all data]

Fujisawa, Oonishi, et al., 1992
Fujisawa, S.; Oonishi, E.; Masuda, S.; Ohno, K.; Harada, Y., Penning ionization electron spectroscopy of dichloro- and trichlorotoluenes, J. Phys. Chem., 1992, 96, 6199. [all data]