Cyclohexyl(2-ethylcyclohexyl)methane

Condensed phase thermochemistry data

Data compiled as indicated in comments:
ALS - Hussein Y. Afeefy, Joel F. Liebman, and Stephen E. Stein
DH - Eugene S. Domalski and Elizabeth D. Hearing

Quantity Value Units Method Reference Comment
Δcliquid-2279.9kcal/molCcbGollis, Belenyessy, et al., 1962Corresponding Δfliquid = -87.24 kcal/mol (simple calculation by NIST; no Washburn corrections); ALS

Constant pressure heat capacity of liquid

Cp,liquid (cal/mol*K) Temperature (K) Reference Comment
91.90313.Gudinowicz, Campbell, et al., 1963T = 313 to 483 K.; DH
96.30313.Gudinowicz, Campbell, et al., 1963T = 313 to 483 K.; DH
98.40311.Gollis, Belenyessy, et al., 1962, 2Temperatures 100, 200, 300°F.; DH

Phase change data

Data compiled by: Thermodynamics Research Center, NIST Boulder Laboratories, Chris Muzny director

Quantity Value Units Method Reference Comment
Tfus252.KN/AGollis, Belenyessy, et al., 1962, 3Uncertainty assigned by TRC = 3. K

In addition to the Thermodynamics Research Center (TRC) data available from this site, much more physical and chemical property data is available from the following TRC products:

References

Gollis, Belenyessy, et al., 1962
Gollis, M.H.; Belenyessy, L.I.; Gudzinowicz, B.J.; Koch, S.D.; Smith, J.O.; Wineman, R.J., Evaluation of pure hydrocarbons as jet fuels, J. Chem. Eng. Data, 1962, 7, 331-316. [all data]

Gudinowicz, Campbell, et al., 1963
Gudinowicz, B.J.; Campbell, R.H.; Adams, J.S., Specific heat measurements of complex saturated hydrocarbons, J. Chem. Eng. Data, 1963, 8, 201-214. [all data]

Gollis, Belenyessy, et al., 1962, 2
Gollis, M.H.; Belenyessy, L.I.; Gudzinowicz, B.J.; Koch, S.D.; Smith, J.O.; Wineman, R.J., Evaluations of pure hydrocarbons as Jet Fuels, J. Chem. Eng. Data, 1962, 7, 311-316. [all data]

Gollis, Belenyessy, et al., 1962, 3
Gollis, M.H.; Belenyessy, L.I.; Gudzinowicz, B.J.; Koch, S.D.; Smith, J.O.; Wineman, R.J., Evaluation of pure hydrocarbons as jet fuels., J. Chem. Eng. Data, 1962, 7, 311-6. [all data]