eicosyl methanoate

Phase change data

Data compiled by: Thermodynamics Research Center, NIST Boulder Laboratories, Chris Muzny director

Quantity Value Units Method Reference Comment
Tfus347.4KN/AScholl and Morrison, 1954Uncertainty assigned by TRC = 2. K

In addition to the Thermodynamics Research Center (TRC) data available from this site, much more physical and chemical property data is available from the following TRC products:

References

Scholl and Morrison, 1954
Scholl, A.W.; Morrison, J.G., Preparation and Properties of n-nonadecyl and n-eicosyl formates, West Va. Univ. Bull., Proc. West Va Acad. Sci., 1954, 26, 35-7. [all data]