Naphthalene, 5-butyl-1,2,3,4-tetrahydro-

Condensed phase thermochemistry data

Data compiled by: Hussein Y. Afeefy, Joel F. Liebman, and Stephen E. Stein

Quantity Value Units Method Reference Comment
Δcliquid-7782.kJ/molCcbHipsher and Wise, 1954Corresponding Δfliquid = -586. kJ/mol (simple calculation by NIST; no Washburn corrections)

Phase change data

Data compiled by: Thermodynamics Research Center, NIST Boulder Laboratories, Chris Muzny director

Quantity Value Units Method Reference Comment
Tboil553.06KN/AHipsher and Wise, 1954, 2Uncertainty assigned by TRC = 0.3 K
Quantity Value Units Method Reference Comment
Tfus224.KN/AHipsher and Wise, 1954, 2Uncertainty assigned by TRC = 2. K

In addition to the Thermodynamics Research Center (TRC) data available from this site, much more physical and chemical property data is available from the following TRC products:

Normal alkane RI, non-polar column, isothermal

View large format table.

Column type Active phase Temperature (C) I Reference Comment
PackedPolydimethyl siloxane147.1536.Ferrand, 1962

References

Hipsher and Wise, 1954
Hipsher, H.F.; Wise, P.H., Dicyclic hydrocarbons. VIII. 1-Alkylnaphthalenes and some of their tetrahydro derivatives, J. Am. Chem. Soc., 1954, 76, 1747-1748. [all data]

Hipsher and Wise, 1954, 2
Hipsher, H.F.; Wise, P.H., Dicyclic Hydrocarbons VIII. 1-Alkylnaphthalenes and Some of Their Tetrahydro Derivatives, J. Am. Chem. Soc., 1954, 76, 1747-8. [all data]

Ferrand, 1962
Ferrand, R., Gas phase chromatography using retention indices for the analysis of tars and their hydrogenation products, Journees internationales d'etude des methodes de separation immediate at de chromatographie; Org. sur l'initiative du IX., 1962, 132-140. [all data]