Pyrene, 4,5-dihydro-

Van Den Dool and Kratz RI, non-polar column, temperature ramp

Data compiled by: NIST Mass Spectrometry Data Center, William E. Wallace, director

Column type CapillaryCapillary
Active phase OV-1OV-1
Column length (m) 25.25.
Carrier gas
Substrate
Column diameter (mm) 0.20.2
Phase thickness (μm) 0.330.33
Tstart (C) 100.100.
Tend (C) 180.180.
Heat rate (K/min) 5.5.
Initial hold (min)
Final hold (min)
I 2059.72094.4
ReferenceZhang, Shen, et al., 2000Zhang, Shen, et al., 2000
Comment MSDC-RI MSDC-RI

References

Zhang, Shen, et al., 2000
Zhang, M.-J.; Shen, S.-D.; Chen, S.-Y.; Sun, Y.-H., Analysis of heavy oil fractions in high-temperature coal tar by capillary gas chromatography/fourier transform infrared spectrometry, Chin. J. Chromatogr., 2000, 18, 3, 241-246. [all data]