Phenol, 2,6-dimethoxy-4-(2-propenyl)-

Normal alkane RI, polar column, custom temperature program

Data compiled by: NIST Mass Spectrometry Data Center, William E. Wallace, director

Column type CapillaryCapillary
Active phase DB-WaxDB-Wax Etr
Column length (m) 60.60.
Carrier gas HeliumHe
Substrate
Column diameter (mm) 0.250.25
Phase thickness (μm) 0.500.5
Program 40 0C (3 min) 10 0C/min -> 90 0C 2 0C/min -> 230 0C (37 min)40C(3min) => 10C/min => 90C => 2C/min => 230C (37min)
I 2563.2563.
ReferenceLoscos, Hernandez-Orte, et al., 2009Loskos, Hernandez-Orte, et al., 2007
Comment MSDC-RI MSDC-RI

Van Den Dool and Kratz RI, non-polar column, temperature ramp

Data compiled by: NIST Mass Spectrometry Data Center, William E. Wallace, director

Column type CapillaryCapillary
Active phase DB-5DB-1
Column length (m) 30.50.
Carrier gas H2He
Substrate
Column diameter (mm) 0.250.32
Phase thickness (μm) 0.251.05
Tstart (C) 60.40.
Tend (C) 240.260.
Heat rate (K/min) 3.2.
Initial hold (min)
Final hold (min)  40.
I 1602.1574.
ReferenceNogueira, Marsaioli, et al., 1998Wu, Kuo, et al., 1991
Comment MSDC-RI MSDC-RI

References

Loscos, Hernandez-Orte, et al., 2009
Loscos, N.; Hernandez-Orte, P.; Cacho, J.; Ferreira, V., Fate of grape flavor precursors during storage on yeast lees, J. Agric. Food Chem., 2009, 57, 12, 5468-5479, https://doi.org/10.1021/jf804057q . [all data]

Loskos, Hernandez-Orte, et al., 2007
Loskos, N.; Hernandez-Orte, P.; Cacho, J.; Ferreira, V., Release and formation of varietal aroma compounds during alcoholic fermentation from nonfloral grape odorless flavor precursors fractions, J. Agric. Food Chem., 2007, 55, 16, 6674-6684, https://doi.org/10.1021/jf0702343 . [all data]