pentadecyl methanoate

Phase change data

Data compiled by: Thermodynamics Research Center, NIST Boulder Laboratories, Chris Muzny director

Quantity Value Units Method Reference Comment
Tfus286.84KN/ARuhoff and Reid, 1933Uncertainty assigned by TRC = 0.15 K

In addition to the Thermodynamics Research Center (TRC) data available from this site, much more physical and chemical property data is available from the following TRC products:

References

Ruhoff and Reid, 1933
Ruhoff, J.R.; Reid, E.E., A group of isomeric esters, J. Am. Chem. Soc., 1933, 55, 3825-8. [all data]