2,2,3,4-tetramethyl-3-hexanol

Phase change data

Data compiled by: Thermodynamics Research Center, NIST Boulder Laboratories, Chris Muzny director

Quantity Value Units Method Reference Comment
Tboil465.0KN/AStehman, Cook, et al., 1950Uncertainty assigned by TRC = 2. K
Tboil464.65KN/ANazarov, 1937Uncertainty assigned by TRC = 4. K

In addition to the Thermodynamics Research Center (TRC) data available from this site, much more physical and chemical property data is available from the following TRC products:

References

Stehman, Cook, et al., 1950
Stehman, C.J.; Cook, N.C.; Percival, W.C.; Whitmore, F.C., Hydrocarbons: XI synthesis of nineteen decenes, J. Am. Chem. Soc., 1950, 72, 4163-5. [all data]

Nazarov, 1937
Nazarov, I.N., Synthesis of Tertiary Alcohols of the General FOrmulas R3CC(OH)MeCHR2 and R3CC(OH)MeCR3. Action of Methylmagnesium Bromide on Branched Ketones, Chem. Ber., 1937, 70, 599-605. [all data]