Methyl(heptafluoropropyl) selenide

Phase change data

Data compiled by: William E. Acree, Jr., James S. Chickos

Enthalpy of vaporization

ΔvapH (kJ/mol) Temperature (K) Reference Comment
30.8278.Dykyj, Svoboda, et al., 1999Based on data from 232. - 324. K. See also Emel«65533»us and Welcman, 1963.

References

Dykyj, Svoboda, et al., 1999
Dykyj, J.; Svoboda, J.; Wilhoit, R.C.; Frenkel, M.L.; Hall, K.R., Vapor Pressure of Chemicals: Part A. Vapor Pressure and Antoine Constants for Hydrocarbons and Sulfur, Selenium, Tellurium and Hydrogen Containing Organic Compounds, Springer, Berlin, 1999, 373. [all data]

Emel«65533»us and Welcman, 1963
Emel«65533»us, H.J.; Welcman, N., 237. Heptafluoropropyl derivatives of selenium, J. Chem. Soc., 1963, 1268, https://doi.org/10.1039/jr9630001268 . [all data]