1-chloro-4-(4-chlorophenoxy)-3,3-dimethyl-2-butanone

Phase change data

Data compiled by: Thermodynamics Research Center, NIST Boulder Laboratories, Chris Muzny director

Quantity Value Units Method Reference Comment
Tfus338.2KN/AVorontsova and Vlasov, 1987Crystal phase 1 phase; Uncertainty assigned by TRC = 0.5 K

In addition to the Thermodynamics Research Center (TRC) data available from this site, much more physical and chemical property data is available from the following TRC products:

References

Vorontsova and Vlasov, 1987
Vorontsova, N.A.; Vlasov, O.N., Determination of saturated vapor pressure of Bayletone and its semiproducts, Deposited Doc. ONIITEkhim Cherkassy, 1987, Doc. No. 1423 khp - 87, 1987. [all data]